program: Orca
programVersion: 5.0.2
elementType: Si F O O C C C C C C C C C C C C C C C C C C C C C C C C C H H H H H H H H H H H H H H H H H H H H H H H H H H H H H
charge: 0
multiplicity: 1
keywords: wb97x-d3
keywords: def2-TZVPP
keywords: def2/J RIJCOSX
keywords: DEFGRID2
keywords: scfconv7
keywords: smallprint printgap noloewdin
keywords: NOSOSCF
formula: C25H29FO2Si
InChI: InChI=1/C25H29FO2Si/c1-4-27-21-13-15-23(16-14-21)29(2,3)18-8-9-20-12-17-24(26)25(19-20)28-22-10-6-5-7-11-22/h5-7,10-17,19H,4,8-9,18H2,1-3H3
58 atoms
Si -3.553988 1.377235 0.408228
F  1.515458 -4.299476 1.113644
O  2.237837 2.976429 1.153839
O  1.869677 -1.897254 0.088105
C  -3.552909 -0.423761 -0.158563
C  -2.995705 -0.603397 -1.569702
C  -1.7614 1.894659 0.667892
C  -4.496343 1.543795 2.026479
C  -4.332984 2.466449 -0.913206
C  -2.656162 -2.052196 -1.916179
C  -1.159817 1.828595 1.923489
C  -0.952131 2.319851 -0.394048
C  -1.557195 -2.643185 -1.071222
C  0.171815 2.171747 2.13363
C  0.375425 2.662086 -0.212742
C  0.947229 2.60067 1.059969
C  -0.352372 -1.960261 -0.900633
C  -1.714111 -3.880949 -0.457261
C  0.681605 -2.517492 -0.165894
C  -0.686995 -4.447048 0.288183
C  0.502059 -3.767226 0.414657
C  2.897985 2.877925 2.411768
C  4.32843 3.314276 2.220058
C  2.432749 -1.049297 -0.83439
C  3.079322 0.069828 -0.33213
C  2.424389 -1.315946 -2.197636
C  3.7202 0.936585 -1.206445
C  3.058254 -0.433481 -3.06047
C  3.706749 0.693684 -2.57275
H  -2.954294 -0.991525 0.56323
H  -4.563053 -0.842983 -0.103347
H  -2.103967 0.013823 -1.717191
H  -3.723078 -0.234581 -2.297059
H  -5.549712 1.293851 1.882412
H  -4.110844 0.87555 2.798944
H  -4.453755 2.561289 2.419791
H  -3.795176 2.420607 -1.861951
H  -5.362317 2.158828 -1.110938
H  -4.359687 3.513201 -0.603705
H  -3.551728 -2.670436 -1.818256
H  -2.360353 -2.104952 -2.9685
H  -1.733943 1.505121 2.78468
H  -1.361482 2.392495 -1.395483
H  0.578946 2.104782 3.133521
H  0.976645 2.986788 -1.053447
H  -0.217753 -0.983764 -1.350896
H  -2.647177 -4.419834 -0.56227
H  -0.809917 -5.412633 0.761951
H  2.85702 1.84759 2.779602
H  2.39879 3.5143 3.149304
H  4.390434 4.344948 1.870058
H  4.855022 3.253966 3.172141
H  4.851239 2.673372 1.508924
H  3.088202 0.253325 0.734955
H  1.934609 -2.19733 -2.591124
H  4.22842 1.807728 -0.814059
H  3.04875 -0.637824 -4.122984
H  4.200703 1.374703 -3.252615
elementType: Si F O C H
totalener: -1510.05384741 hartree
nucrepener: 2952.34715603 hartree
electener: -4462.40100344 hartree
oneelecener: -7935.67922074 hartree
twoeener: 3473.27821731 hartree
cpcmener: -0.02865127 hartree
kineticenergy: 1503.91414788 hartree
xcener: -135.233168017359 hartree
chargesum: -0.0000000
charge: 0.484000 -0.220897 -0.336817 -0.338645 -0.237143 -0.129493 -0.149499 -0.460794 -0.430577 -0.096468 -0.142637 -0.120072 -0.025576 -0.239747 -0.312347 0.342576 -0.237170 -0.184485 0.271569 -0.166760 0.168326 0.033300 -0.277816 0.311271 -0.257954 -0.202104 -0.139345 -0.145935 -0.184385 0.078669 0.086407 0.072969 0.091740 0.106875 0.101015 0.106012 0.102363 0.108356 0.109593 0.081543 0.096997 0.141523 0.147717 0.140627 0.133934 0.146020 0.142251 0.150111 0.099717 0.114996 0.090045 0.096807 0.088235 0.151388 0.157815 0.157379 0.162971 0.161549
qa: 0.4840 -0.2209 -0.3368 -0.3386 -0.2371 -0.1295 -0.1495 -0.4608 -0.4306 -0.0965 -0.1426 -0.1201 -0.0256 -0.2397 -0.3123 0.3426 -0.2372 -0.1845 0.2716 -0.1668 0.1683 0.0333 -0.2778 0.3113 -0.2580 -0.2021 -0.1393 -0.1459 -0.1844 0.0787 0.0864 0.0730 0.0917 0.1069 0.1010 0.1060 0.1024 0.1084 0.1096 0.0815 0.0970 0.1415 0.1477 0.1406 0.1339 0.1460 0.1423 0.1501 0.0997 0.1150 0.0900 0.0968 0.0882 0.1514 0.1578 0.1574 0.1630 0.1615
va: 4.1382 1.0629 2.0457 2.0676 3.8152 3.8928 3.7059 3.9236 3.8891 3.8557 3.9193 3.8388 3.7081 3.9103 4.0013 3.7048 3.8954 3.8805 3.5944 3.8799 4.0560 3.7891 3.9682 3.7019 3.9063 3.8983 3.8504 3.8881 3.9333 1.0140 1.0125 1.0016 1.0060 1.0109 1.0107 1.0100 1.0087 1.0066 1.0087 1.0073 1.0003 0.9889 0.9834 1.0105 1.0165 0.9957 1.0013 0.9976 0.9846 0.9898 1.0026 1.0063 0.9996 1.0065 0.9958 0.9927 0.9883 0.9898
dispcorr: -0.032502204 hartree
energy: -1510.086349614512
dipole: -16.61907 15.87788 -0.74119 23.17191 -22.69138 0.48053 -0.74808 0.44434 -0.30374
magnitude: 0.93410 au
magnitude: 2.37428 debye
