program: Orca
programVersion: 5.0.2
elementType: Si F O O C C C C C C C C C C C C C C C C C C C C C C C C C H H H H H H H H H H H H H H H H H H H H H H H H H H H H H
charge: 0
multiplicity: 1
keywords: wb97x-d3
keywords: def2-TZVPP
keywords: def2/J RIJCOSX
keywords: DEFGRID2
keywords: scfconv7
keywords: smallprint printgap noloewdin
keywords: NOSOSCF
formula: C25H29FO2Si
InChI: InChI=1/C25H29FO2Si/c1-4-27-21-13-15-23(16-14-21)29(2,3)18-8-9-20-12-17-24(26)25(19-20)28-22-10-6-5-7-11-22/h5-7,10-17,19H,4,8-9,18H2,1-3H3
58 atoms
Si -3.591904 1.194975 0.92088
F  1.972934 -3.63719 -0.381056
O  2.134717 2.654753 -0.384204
O  1.906287 -0.930999 -0.888611
C  -3.723587 -0.697734 0.879075
C  -4.026024 -1.332374 -0.47872
C  -1.843135 1.744692 0.494428
C  -3.964358 1.762748 2.678162
C  -4.807692 1.956349 -0.295896
C  -2.938643 -1.14938 -1.537896
C  -0.779685 1.431652 1.349471
C  -1.522555 2.420494 -0.680549
C  -1.628907 -1.810113 -1.200426
C  0.528162 1.755008 1.040917
C  -0.213499 2.749463 -1.018417
C  0.826322 2.401843 -0.159847
C  -0.451421 -1.0713 -1.13649
C  -1.563149 -3.181967 -0.963327
C  0.762508 -1.67959 -0.859619
C  -0.356557 -3.80354 -0.679606
C  0.7963 -3.048385 -0.639378
C  2.548001 3.171353 -1.645871
C  2.541151 2.129164 -2.743104
C  2.723324 -0.881595 0.210611
C  2.292584 -1.188206 1.494361
C  4.027613 -0.462215 -0.018049
C  3.188694 -1.083799 2.549894
C  4.908718 -0.36027 1.047295
C  4.497293 -0.674704 2.3359
H  -2.810844 -1.127822 1.307224
H  -4.522754 -0.972498 1.576298
H  -4.955721 -0.917278 -0.877237
H  -4.215487 -2.402279 -0.349218
H  -3.271993 1.31716 3.395969
H  -3.883163 2.846765 2.776818
H  -4.973448 1.478471 2.983856
H  -4.590887 1.674039 -1.327996
H  -5.827925 1.632519 -0.079846
H  -4.796443 3.04683 -0.244926
H  -3.307119 -1.563904 -2.480692
H  -2.768343 -0.086365 -1.724407
H  -0.966211 0.914199 2.284628
H  -2.304277 2.696919 -1.37894
H  1.330952 1.499228 1.721191
H  -0.03154 3.261898 -1.953442
H  -0.466691 -0.004223 -1.32315
H  -2.461677 -3.784362 -1.009017
H  -0.306199 -4.870579 -0.504987
H  3.564274 3.528155 -1.480535
H  1.947823 4.042815 -1.922124
H  3.206923 1.299906 -2.503785
H  1.547121 1.727281 -2.939591
H  2.899239 2.585589 -3.666595
H  1.271192 -1.490837 1.687866
H  4.349654 -0.22296 -1.023877
H  2.851776 -1.323386 3.549916
H  5.925418 -0.03835 0.863994
H  5.188846 -0.599132 3.16413
elementType: Si F O C H
totalener: -1510.05203494 hartree
nucrepener: 3047.57815282 hartree
electener: -4557.63018775 hartree
oneelecener: -8126.45527956 hartree
twoeener: 3568.82509181 hartree
cpcmener: -0.02861137 hartree
kineticenergy: 1503.92532144 hartree
xcener: -135.240482386487 hartree
chargesum: 0.0000000
charge: 0.494965 -0.219589 -0.348744 -0.329615 -0.266363 -0.160479 -0.131400 -0.463552 -0.444629 -0.094641 -0.093736 -0.162432 -0.033430 -0.316404 -0.226160 0.335201 -0.193934 -0.156553 0.150534 -0.197913 0.278620 0.044222 -0.276978 0.333746 -0.214529 -0.298795 -0.160062 -0.114928 -0.191419 0.080863 0.097750 0.088574 0.093627 0.101461 0.100758 0.103053 0.103725 0.114010 0.114352 0.102813 0.084600 0.132944 0.144225 0.136831 0.140054 0.142812 0.143156 0.149085 0.112306 0.093691 0.084337 0.091126 0.105489 0.151081 0.164500 0.160891 0.160242 0.160639
qa: 0.4950 -0.2196 -0.3487 -0.3296 -0.2664 -0.1605 -0.1314 -0.4636 -0.4446 -0.0946 -0.0937 -0.1624 -0.0334 -0.3164 -0.2262 0.3352 -0.1939 -0.1566 0.1505 -0.1979 0.2786 0.0442 -0.2770 0.3337 -0.2145 -0.2988 -0.1601 -0.1149 -0.1914 0.0809 0.0977 0.0886 0.0936 0.1015 0.1008 0.1031 0.1037 0.1140 0.1144 0.1028 0.0846 0.1329 0.1442 0.1368 0.1401 0.1428 0.1432 0.1491 0.1123 0.0937 0.0843 0.0911 0.1055 0.1511 0.1645 0.1609 0.1602 0.1606
va: 4.0818 1.0656 2.0420 2.0302 3.8355 3.8983 3.6491 3.9023 3.9121 3.7884 3.8304 3.8518 3.6842 4.0077 3.8570 3.6868 3.8729 3.8658 3.7372 3.9478 3.9509 3.8342 3.9162 3.5146 3.8596 3.9848 3.9086 3.8910 3.9062 1.0150 1.0055 1.0009 1.0022 1.0110 1.0105 1.0107 1.0065 1.0074 1.0090 1.0050 1.0136 0.9955 0.9895 1.0070 1.0048 0.9863 1.0017 0.9995 0.9926 0.9979 1.0069 1.0004 1.0130 1.0074 0.9951 0.9891 0.9886 0.9887
dispcorr: -0.036745053 hartree
energy: -1510.088779990673
dipole: -22.59449 21.42506 -1.16943 16.89205 -16.59827 0.29377 -0.91546 0.32328 -0.59218
magnitude: 1.34334 au
magnitude: 3.41449 debye
