program: Orca
programVersion: 5.0.2
elementType: Si F O O C C C C C C C C C C C C C C C C C C C C C C C C C H H H H H H H H H H H H H H H H H H H H H H H H H H H H H
charge: 0
multiplicity: 1
keywords: wb97x-d3
keywords: def2-TZVPP
keywords: def2/J RIJCOSX
keywords: DEFGRID2
keywords: scfconv7
keywords: smallprint printgap noloewdin
keywords: NOSOSCF
formula: C25H29FO2Si
InChI: InChI=1/C25H29FO2Si/c1-4-27-21-13-15-23(16-14-21)29(2,3)18-8-9-20-12-17-24(26)25(19-20)28-22-10-6-5-7-11-22/h5-7,10-17,19H,4,8-9,18H2,1-3H3
58 atoms
Si -2.660265 1.366019 0.45201
F  0.908395 -4.19764 -3.191509
O  2.634752 4.09734 1.515405
O  1.676106 -3.362173 -0.753909
C  -2.24048 -0.469224 0.61542
C  -3.40556 -1.431395 0.401945
C  -1.059037 2.307348 0.754644
C  -3.931031 1.856543 1.753682
C  -3.305995 1.74571 -1.274287
C  -3.0332 -2.910594 0.593087
C  -0.35565 2.131056 1.952418
C  -0.482704 3.153536 -0.190392
C  -1.98531 -3.354487 -0.385024
C  0.856258 2.751984 2.188347
C  0.736224 3.789652 0.022944
C  1.421758 3.57986 1.216319
C  -0.634312 -3.218269 -0.080101
C  -2.337789 -3.824845 -1.647195
C  0.340114 -3.499791 -1.024013
C  -1.370636 -4.13466 -2.593043
C  -0.040977 -3.948284 -2.278184
C  3.235844 5.046486 0.639933
C  2.611045 6.421644 0.745378
C  2.10757 -2.140117 -0.292703
C  3.149092 -2.140425 0.623748
C  1.555391 -0.945954 -0.740351
C  3.638761 -0.931051 1.097182
C  2.048654 0.254246 -0.250114
C  3.087881 0.269793 0.670696
H  -1.437942 -0.676897 -0.100166
H  -1.800183 -0.634064 1.605903
H  -3.820764 -1.300707 -0.602057
H  -4.215636 -1.197454 1.098528
H  -3.568037 1.6402 2.760687
H  -4.155499 2.923936 1.709023
H  -4.872044 1.318766 1.622596
H  -4.242339 1.217193 -1.463556
H  -3.505253 2.810433 -1.409199
H  -2.599649 1.440178 -2.048065
H  -2.678836 -3.060508 1.616018
H  -3.931241 -3.52093 0.473655
H  -0.75452 1.485734 2.72805
H  -0.982008 3.331457 -1.136018
H  1.381802 2.588355 3.121339
H  1.132412 4.428326 -0.754875
H  -0.335467 -2.866828 0.900787
H  -3.382962 -3.949727 -1.901664
H  -1.648103 -4.497812 -3.574141
H  3.226299 4.682254 -0.391228
H  4.279228 5.088274 0.951013
H  2.658029 6.794424 1.76881
H  3.16269 7.116045 0.111365
H  1.570342 6.436927 0.422309
H  3.570907 -3.078241 0.962625
H  0.750397 -0.94232 -1.464686
H  4.449327 -0.933005 1.814098
H  1.613851 1.183662 -0.59507
H  3.46432 1.210412 1.050149
elementType: Si F O C H
totalener: -1510.05250621 hartree
nucrepener: 2911.05621091 hartree
electener: -4421.10871713 hartree
oneelecener: -7852.51643315 hartree
twoeener: 3431.40771602 hartree
cpcmener: -0.02775523 hartree
kineticenergy: 1503.91775327 hartree
xcener: -135.234256074913 hartree
chargesum: -0.0000000
charge: 0.513744 -0.220307 -0.355215 -0.349732 -0.229608 -0.149487 -0.187759 -0.428557 -0.451865 -0.092667 -0.078448 -0.153839 0.058222 -0.345584 -0.220582 0.354560 -0.240915 -0.212987 0.206367 -0.170718 0.189042 0.047078 -0.260755 0.282029 -0.234850 -0.190631 -0.133264 -0.184607 -0.186094 0.059223 0.090439 0.082569 0.082392 0.104767 0.106105 0.102596 0.109383 0.107959 0.107850 0.088172 0.091227 0.133917 0.141706 0.133486 0.141505 0.154548 0.145979 0.150759 0.087024 0.110329 0.088123 0.095961 0.091100 0.147730 0.160144 0.160043 0.188513 0.163876
qa: 0.5137 -0.2203 -0.3552 -0.3497 -0.2296 -0.1495 -0.1878 -0.4286 -0.4519 -0.0927 -0.0784 -0.1538 0.0582 -0.3456 -0.2206 0.3546 -0.2409 -0.2130 0.2064 -0.1707 0.1890 0.0471 -0.2608 0.2820 -0.2348 -0.1906 -0.1333 -0.1846 -0.1861 0.0592 0.0904 0.0826 0.0824 0.1048 0.1061 0.1026 0.1094 0.1080 0.1079 0.0882 0.0912 0.1339 0.1417 0.1335 0.1415 0.1545 0.1460 0.1508 0.0870 0.1103 0.0881 0.0960 0.0911 0.1477 0.1601 0.1600 0.1885 0.1639
va: 4.0979 1.0646 2.0300 2.0597 3.8214 3.9307 3.7524 3.8943 3.9251 3.8518 3.8096 3.8513 3.5954 4.0346 3.8709 3.6180 3.9163 3.9078 3.6578 3.8756 4.0725 3.8509 3.9257 3.6822 3.9997 3.8829 3.9267 3.8442 3.8669 1.0290 1.0141 1.0025 1.0089 1.0071 1.0089 1.0078 1.0085 1.0079 1.0062 1.0096 1.0080 0.9938 0.9909 1.0167 1.0061 1.0005 1.0006 0.9969 0.9962 0.9921 1.0054 1.0084 1.0020 1.0058 0.9978 0.9889 0.9724 0.9947
dispcorr: -0.032796770 hartree
energy: -1510.085302983316
dipole: -16.39411 15.36463 -1.02948 30.81068 -29.45451 1.35617 11.39675 -11.27841 0.11834
magnitude: 1.70676 au
magnitude: 4.33824 debye
