program: Orca
programVersion: 5.0.2
elementType: Si F O O C C C C C C C C C C C C C C C C C C C C C C C C C H H H H H H H H H H H H H H H H H H H H H H H H H H H H H
charge: 0
multiplicity: 1
keywords: wb97x-d3
keywords: def2-TZVPP
keywords: def2/J RIJCOSX
keywords: DEFGRID2
keywords: scfconv7
keywords: smallprint printgap noloewdin
keywords: NOSOSCF
formula: C25H29FO2Si
InChI: InChI=1/C25H29FO2Si/c1-4-27-21-13-15-23(16-14-21)29(2,3)18-8-9-20-12-17-24(26)25(19-20)28-22-10-6-5-7-11-22/h5-7,10-17,19H,4,8-9,18H2,1-3H3
58 atoms
Si -4.160817 1.387214 0.844913
F  2.218442 -3.509958 -1.280398
O  1.820546 2.296972 0.667533
O  1.724247 -0.806584 -1.546263
C  -4.454577 -0.442894 1.289334
C  -3.297601 -1.395575 0.991436
C  -2.310135 1.73023 0.764478
C  -4.934035 2.454453 2.191103
C  -4.935471 1.811535 -0.817533
C  -2.980443 -1.521302 -0.501962
C  -1.466229 1.379129 1.826639
C  -1.704474 2.301496 -0.352315
C  -1.605363 -2.076547 -0.736378
C  -0.098767 1.569538 1.770562
C  -0.331145 2.515113 -0.42987
C  0.482095 2.142294 0.6363
C  -0.548561 -1.208865 -1.000882
C  -1.339149 -3.438405 -0.63482
C  0.737897 -1.683161 -1.187121
C  -0.050309 -3.927169 -0.805402
C  0.973085 -3.048402 -1.087857
C  2.477454 2.87257 -0.456155
C  3.943625 2.989088 -0.124605
C  2.892888 -0.779028 -0.823205
C  4.056835 -0.517192 -1.531445
C  2.91929 -0.958875 0.552764
C  5.264698 -0.449305 -0.853472
C  4.137653 -0.894957 1.216252
C  5.312716 -0.64578 0.520579
H  -4.694283 -0.49445 2.356122
H  -5.359929 -0.779156 0.771398
H  -3.51526 -2.391589 1.388599
H  -2.402538 -1.056967 1.517511
H  -4.46311 2.276238 3.160053
H  -4.833712 3.518336 1.968139
H  -5.999501 2.242084 2.303793
H  -6.011901 1.627774 -0.79335
H  -4.794526 2.862439 -1.077962
H  -4.524897 1.211217 -1.631705
H  -3.733887 -2.150369 -0.982548
H  -3.045098 -0.543278 -0.985003
H  -1.880663 0.938103 2.727098
H  -2.305023 2.592367 -1.20664
H  0.530512 1.281308 2.603959
H  0.080455 2.961165 -1.325083
H  -0.72588 -0.142497 -1.08176
H  -2.143511 -4.13277 -0.426742
H  0.157414 -4.987182 -0.735911
H  2.057653 3.859678 -0.67446
H  2.327705 2.245496 -1.341284
H  4.476623 3.398078 -0.982528
H  4.109678 3.657063 0.720941
H  4.382124 2.018702 0.107432
H  4.015437 -0.373152 -2.603645
H  2.008025 -1.144324 1.108479
H  6.172786 -0.24806 -1.406442
H  4.162266 -1.038174 2.288583
H  6.257204 -0.599544 1.045792
elementType: Si F O C H
totalener: -1510.05194688 hartree
nucrepener: 3000.26731562 hartree
electener: -4510.31926250 hartree
oneelecener: -8031.63203139 hartree
twoeener: 3521.31276889 hartree
cpcmener: -0.02644211 hartree
kineticenergy: 1503.92551025 hartree
xcener: -135.236182156506 hartree
chargesum: -0.0000000
charge: 0.492049 -0.221406 -0.335823 -0.337956 -0.293523 -0.153790 -0.147109 -0.450747 -0.436849 -0.063592 -0.136645 -0.139445 -0.020744 -0.283994 -0.233958 0.335520 -0.233922 -0.170781 0.126638 -0.191501 0.291007 0.026077 -0.273563 0.310375 -0.269317 -0.192197 -0.127777 -0.157205 -0.163724 0.100950 0.086833 0.095541 0.088263 0.100993 0.099645 0.102468 0.110972 0.105356 0.108853 0.101308 0.072845 0.141862 0.144949 0.134934 0.136889 0.160257 0.146455 0.149678 0.122538 0.102793 0.098420 0.098546 0.062901 0.145360 0.157333 0.157266 0.161087 0.158610
qa: 0.4920 -0.2214 -0.3358 -0.3380 -0.2935 -0.1538 -0.1471 -0.4507 -0.4368 -0.0636 -0.1366 -0.1394 -0.0207 -0.2840 -0.2340 0.3355 -0.2339 -0.1708 0.1266 -0.1915 0.2910 0.0261 -0.2736 0.3104 -0.2693 -0.1922 -0.1278 -0.1572 -0.1637 0.1009 0.0868 0.0955 0.0883 0.1010 0.0996 0.1025 0.1110 0.1054 0.1089 0.1013 0.0728 0.1419 0.1449 0.1349 0.1369 0.1603 0.1465 0.1497 0.1225 0.1028 0.0984 0.0985 0.0629 0.1454 0.1573 0.1573 0.1611 0.1586
va: 4.0761 1.0595 2.0353 2.0203 3.8738 3.8593 3.6926 3.8996 3.8992 3.7628 3.8603 3.8441 3.7331 3.9909 3.8695 3.6831 3.8761 3.9007 3.8169 3.9429 3.9137 3.7817 3.9562 3.4948 3.9807 3.8594 3.8525 3.9042 3.8494 1.0059 1.0096 1.0090 1.0067 1.0107 1.0113 1.0096 1.0105 1.0075 1.0073 1.0090 1.0205 0.9871 0.9899 1.0138 1.0130 1.0012 0.9993 0.9991 0.9917 0.9819 1.0062 1.0081 1.0094 1.0097 1.0001 0.9903 0.9899 0.9901
dispcorr: -0.035578976 hartree
energy: -1510.087525853242
dipole: -20.23673 19.53601 -0.70072 18.89332 -18.63610 0.25721 7.69577 -7.71784 -0.02206
magnitude: 0.74676 au
magnitude: 1.89811 debye
