program: Orca
programVersion: 5.0.2
elementType: Si F O O C C C C C C C C C C C C C C C C C C C C C C C C C H H H H H H H H H H H H H H H H H H H H H H H H H H H H H
charge: 0
multiplicity: 1
keywords: wb97x-d3
keywords: def2-TZVPP
keywords: def2/J RIJCOSX
keywords: DEFGRID2
keywords: scfconv7
keywords: smallprint printgap noloewdin
keywords: NOSOSCF
formula: C25H29FO2Si
InChI: InChI=1/C25H29FO2Si/c1-4-27-21-13-15-23(16-14-21)29(2,3)18-8-9-20-12-17-24(26)25(19-20)28-22-10-6-5-7-11-22/h5-7,10-17,19H,4,8-9,18H2,1-3H3
58 atoms
Si -2.477795 1.771307 -0.717632
F  2.861643 -1.644624 1.026065
O  1.286097 1.05036 3.970672
O  2.316337 -1.898032 -1.572705
C  -2.628108 0.034582 -1.442722
C  -3.192946 -1.008183 -0.466916
C  -1.334322 1.653102 0.774922
C  -4.158376 2.399598 -0.153376
C  -1.720434 2.908588 -2.011613
C  -2.485855 -2.368538 -0.534284
C  0.058204 1.716618 0.645465
C  -1.829682 1.411134 2.056058
C  -1.048239 -2.25693 -0.111319
C  0.904106 1.531159 1.723924
C  -1.001009 1.220663 3.156239
C  0.380741 1.266827 2.99093
C  -0.034477 -2.183886 -1.060182
C  -0.710941 -2.144189 1.236634
C  1.282509 -1.962392 -0.681774
C  0.605082 -1.956211 1.62894
C  1.586416 -1.852378 0.664955
C  0.84678 0.792849 5.301064
C  0.455497 2.051007 6.045787
C  2.168705 -1.189824 -2.739942
C  1.410844 -0.028122 -2.825271
C  2.864462 -1.66539 -3.842518
C  1.345799 0.648223 -4.035519
C  2.800058 -0.97067 -5.041548
C  2.036302 0.183922 -5.147072
H  -3.221202 0.055834 -2.3616
H  -1.616556 -0.239067 -1.762286
H  -4.256549 -1.154984 -0.665479
H  -3.136734 -0.661846 0.570442
H  -4.088372 3.381344 0.318666
H  -4.844207 2.489334 -0.998236
H  -4.623028 1.722708 0.566567
H  -2.379814 3.006473 -2.87662
H  -1.539236 3.912355 -1.623059
H  -0.766937 2.52047 -2.378525
H  -3.008424 -3.073735 0.116222
H  -2.546594 -2.764873 -1.550478
H  0.506464 1.914847 -0.321937
H  -2.899878 1.364728 2.22375
H  1.978332 1.576003 1.590514
H  -1.453642 1.033849 4.120624
H  -0.277715 -2.287639 -2.111092
H  -1.483826 -2.20171 1.993063
H  0.868611 -1.870919 2.675288
H  1.699632 0.323029 5.7905
H  0.035487 0.059519 5.304449
H  1.280521 2.763232 6.072074
H  -0.411869 2.546964 5.609995
H  0.204922 1.794373 7.075567
H  0.874945 0.355525 -1.966162
H  3.453798 -2.569744 -3.75972
H  0.752211 1.551155 -4.10144
H  3.345441 -1.342763 -5.898879
H  1.981678 0.718271 -6.085918
elementType: Si F O C H
totalener: -1510.05036405 hartree
nucrepener: 3007.01573739 hartree
electener: -4517.06610144 hartree
oneelecener: -8044.74777647 hartree
twoeener: 3527.68167504 hartree
cpcmener: -0.03020846 hartree
kineticenergy: 1503.90665867 hartree
xcener: -135.235612113116 hartree
chargesum: 0.0000000
charge: 0.458192 -0.223562 -0.351699 -0.343634 -0.231921 -0.141822 -0.134024 -0.438112 -0.420291 -0.092010 -0.118336 -0.169694 0.096701 -0.299830 -0.223281 0.345253 -0.256177 -0.291463 0.256769 -0.135541 0.171544 0.052827 -0.264338 0.252903 -0.131836 -0.223603 -0.187893 -0.146794 -0.162723 0.098939 0.056046 0.092297 0.072513 0.106683 0.106328 0.101140 0.106887 0.109285 0.080976 0.094749 0.086957 0.145790 0.146759 0.128250 0.140936 0.150641 0.143993 0.147671 0.109308 0.086561 0.087997 0.091233 0.094663 0.134842 0.147831 0.162694 0.161105 0.161319
qa: 0.4582 -0.2236 -0.3517 -0.3436 -0.2319 -0.1418 -0.1340 -0.4381 -0.4203 -0.0920 -0.1183 -0.1697 0.0967 -0.2998 -0.2233 0.3453 -0.2562 -0.2915 0.2568 -0.1355 0.1715 0.0528 -0.2643 0.2529 -0.1318 -0.2236 -0.1879 -0.1468 -0.1627 0.0989 0.0560 0.0923 0.0725 0.1067 0.1063 0.1011 0.1069 0.1093 0.0810 0.0947 0.0870 0.1458 0.1468 0.1283 0.1409 0.1506 0.1440 0.1477 0.1093 0.0866 0.0880 0.0912 0.0947 0.1348 0.1478 0.1627 0.1611 0.1613
va: 4.1319 1.0582 2.0384 2.0724 3.8124 3.9065 3.6536 3.9176 3.9089 3.8507 3.8375 3.8719 3.5612 3.9964 3.8713 3.6748 3.9307 3.8860 3.6096 3.7893 4.0667 3.8427 3.9253 3.7543 3.8443 3.9621 3.9053 3.9051 3.8929 1.0115 1.0182 1.0110 1.0036 1.0093 1.0098 1.0104 1.0108 1.0109 1.0151 1.0062 1.0084 0.9704 0.9848 1.0184 1.0059 1.0016 1.0049 0.9985 0.9927 0.9968 1.0056 1.0016 1.0082 0.9877 1.0070 0.9900 0.9877 0.9897
dispcorr: -0.035655194 hartree
energy: -1510.086019241706
dipole: -26.43767 24.46939 -1.96827 15.49125 -15.38424 0.10701 4.55076 -4.23893 0.31183
magnitude: 1.99569 au
magnitude: 5.07265 debye
