program: Orca
programVersion: 5.0.2
elementType: Si F O O C C C C C C C C C C C C C C C C C C C C C C C C C H H H H H H H H H H H H H H H H H H H H H H H H H H H H H
charge: 0
multiplicity: 1
keywords: wb97x-d3
keywords: def2-TZVPP
keywords: def2/J RIJCOSX
keywords: DEFGRID2
keywords: scfconv7
keywords: smallprint printgap noloewdin
keywords: NOSOSCF
formula: C25H29FO2Si
InChI: InChI=1/C25H29FO2Si/c1-4-27-21-13-15-23(16-14-21)29(2,3)18-8-9-20-12-17-24(26)25(19-20)28-22-10-6-5-7-11-22/h5-7,10-17,19H,4,8-9,18H2,1-3H3
58 atoms
Si -3.157071 0.115714 0.257902
F  3.735675 -0.13125 -0.087083
O  0.686576 2.939582 3.999734
O  2.443628 -1.97793 -1.509959
C  -2.327844 0.077341 -1.435199
C  -1.969773 1.453624 -2.002123
C  -1.955481 0.962102 1.438222
C  -3.462107 -1.653389 0.826458
C  -4.764975 1.089258 0.216309
C  -0.800977 1.431364 -3.000029
C  -2.373704 1.895263 2.392185
C  -0.585224 0.704959 1.375928
C  0.478433 1.037551 -2.317694
C  -1.478818 2.538903 3.229893
C  0.332856 1.337397 2.204011
C  -0.112949 2.268768 3.139284
C  0.899803 -0.288894 -2.315481
C  1.208268 1.971329 -1.585611
C  1.987155 -0.691565 -1.552974
C  2.31991 1.588442 -0.850813
C  2.684573 0.259082 -0.823423
C  2.100702 2.896762 3.828063
C  2.573984 3.725107 2.653455
C  1.541378 -3.01571 -1.51792
C  0.350991 -2.972625 -0.802198
C  1.894562 -4.145586 -2.240635
C  -0.495371 -4.071479 -0.831868
C  1.044814 -5.242999 -2.248292
C  -0.156658 -5.208507 -1.554054
H  -1.426409 -0.532679 -1.308076
H  -2.946609 -0.476112 -2.149157
H  -1.71074 2.153575 -1.200212
H  -2.846234 1.880805 -2.496181
H  -2.52287 -2.20665 0.904731
H  -3.941423 -1.686174 1.806896
H  -4.104396 -2.194891 0.12861
H  -5.261469 1.106267 1.188542
H  -4.60284 2.125252 -0.087883
H  -5.466418 0.647784 -0.495086
H  -1.024497 0.736138 -3.812798
H  -0.693621 2.422968 -3.445624
H  -3.425088 2.141941 2.487304
H  -0.194652 -0.00439 0.653463
H  -1.832297 3.261932 3.955081
H  1.381603 1.09465 2.097231
H  0.356834 -1.02091 -2.901488
H  0.903487 3.010341 -1.579113
H  2.888074 2.312005 -0.28043
H  2.45202 1.863879 3.753742
H  2.504463 3.302047 4.755412
H  3.663249 3.695111 2.609455
H  2.196277 3.357194 1.699303
H  2.273074 4.767512 2.761431
H  0.077462 -2.098904 -0.224286
H  2.827044 -4.166862 -2.789924
H  -1.425975 -4.033496 -0.279958
H  1.322861 -6.123891 -2.811778
H  -0.821368 -6.061616 -1.571923
elementType: Si F O C H
totalener: -1510.05092637 hartree
nucrepener: 2973.76060452 hartree
electener: -4483.81153089 hartree
oneelecener: -7977.18355173 hartree
twoeener: 3493.37202084 hartree
cpcmener: -0.02873034 hartree
kineticenergy: 1503.90603058 hartree
xcener: -135.234816130991 hartree
chargesum: 0.0000000
charge: 0.441657 -0.223967 -0.353768 -0.344201 -0.196900 -0.159802 -0.255959 -0.413618 -0.451858 -0.081157 -0.041952 -0.022323 0.087852 -0.316074 -0.309625 0.369776 -0.265078 -0.229867 0.249555 -0.224222 0.216078 0.053160 -0.261408 0.230856 -0.162608 -0.226188 -0.183756 -0.141844 -0.167401 0.018526 0.097140 0.082337 0.090430 0.093666 0.107466 0.105405 0.104321 0.109397 0.109095 0.084420 0.094045 0.141301 0.098947 0.133941 0.150489 0.153872 0.141652 0.159627 0.086365 0.109342 0.096038 0.079680 0.092911 0.211503 0.148104 0.162050 0.161384 0.161188
qa: 0.4417 -0.2240 -0.3538 -0.3442 -0.1969 -0.1598 -0.2560 -0.4136 -0.4519 -0.0812 -0.0420 -0.0223 0.0879 -0.3161 -0.3096 0.3698 -0.2651 -0.2299 0.2496 -0.2242 0.2161 0.0532 -0.2614 0.2309 -0.1626 -0.2262 -0.1838 -0.1418 -0.1674 0.0185 0.0971 0.0823 0.0904 0.0937 0.1075 0.1054 0.1043 0.1094 0.1091 0.0844 0.0940 0.1413 0.0989 0.1339 0.1505 0.1539 0.1417 0.1596 0.0864 0.1093 0.0960 0.0797 0.0929 0.2115 0.1481 0.1620 0.1614 0.1612
va: 4.1469 1.0583 2.0582 2.0734 3.8078 3.9207 3.7592 3.8861 3.9257 3.8529 3.7721 3.6834 3.5660 4.0723 3.9049 3.6979 3.9054 3.8568 3.6445 3.8346 4.0053 3.8535 3.9178 3.7836 3.8603 3.9760 3.9135 3.8944 3.9073 1.0357 1.0177 1.0004 1.0087 1.0112 1.0118 1.0075 1.0093 1.0056 1.0095 1.0091 1.0068 0.9847 0.9782 1.0150 0.9974 0.9989 1.0047 0.9920 0.9958 0.9920 1.0089 1.0003 1.0074 0.9192 1.0065 0.9931 0.9877 0.9904
dispcorr: -0.034727196 hartree
energy: -1510.085653569767
dipole: -23.18404 22.48402 -0.70002 8.77582 -8.57150 0.20433 1.29140 -2.13688 -0.84547
magnitude: 1.11651 au
magnitude: 2.83795 debye
