program: Orca
programVersion: 5.0.2
elementType: Si F O O C C C C C C C C C C C C C C C C C C C C C C C C C H H H H H H H H H H H H H H H H H H H H H H H H H H H H H
charge: 0
multiplicity: 1
keywords: wb97x-d3
keywords: def2-TZVPP
keywords: def2/J RIJCOSX
keywords: DEFGRID2
keywords: scfconv7
keywords: smallprint printgap noloewdin
keywords: NOSOSCF
formula: C25H29FO2Si
InChI: InChI=1/C25H29FO2Si/c1-4-27-21-13-15-23(16-14-21)29(2,3)18-8-9-20-12-17-24(26)25(19-20)28-22-10-6-5-7-11-22/h5-7,10-17,19H,4,8-9,18H2,1-3H3
58 atoms
Si -3.504096 1.286429 0.886031
F  0.432732 -3.159949 -3.776217
O  2.019091 3.717093 0.45681
O  1.915143 -2.761936 -1.625167
C  -3.272825 -0.555195 0.54197
C  -2.355931 -1.274335 1.527127
C  -1.809932 2.100377 0.787513
C  -4.236723 1.575718 2.593483
C  -4.62325 2.00395 -0.447553
C  -2.136601 -2.75715 1.197919
C  -1.272783 2.853982 1.828012
C  -1.011988 1.938479 -0.352892
C  -1.45354 -2.942765 -0.126146
C  -0.00303 3.419306 1.760201
C  0.250542 2.493116 -0.446511
C  0.769289 3.233896 0.618135
C  -0.073164 -2.777224 -0.223192
C  -2.18014 -3.213517 -1.281109
C  0.56541 -2.850054 -1.451689
C  -1.551277 -3.295578 -2.516111
C  -0.191146 -3.098183 -2.589959
C  2.661259 4.342637 1.563043
C  4.079644 4.659605 1.160982
C  2.678094 -1.934157 -0.839469
C  3.947945 -2.390469 -0.515251
C  2.249785 -0.675667 -0.436805
C  4.798743 -1.576889 0.218592
C  3.108092 0.120798 0.308023
C  4.38174 -0.321498 0.638759
H  -4.255163 -1.040926 0.523277
H  -2.881207 -0.648192 -0.477189
H  -2.771627 -1.208403 2.536532
H  -1.381608 -0.776651 1.567936
H  -4.379916 2.638237 2.799588
H  -5.214336 1.096666 2.679366
H  -3.605794 1.168746 3.385884
H  -4.196181 1.855738 -1.441861
H  -5.606093 1.527693 -0.44195
H  -4.777493 3.076299 -0.313831
H  -1.538336 -3.212718 1.990748
H  -3.100684 -3.271391 1.19175
H  -1.846387 3.014451 2.733753
H  -1.375566 1.359288 -1.19558
H  0.3621 3.992218 2.601794
H  0.849999 2.348442 -1.337288
H  0.504816 -2.588943 0.674164
H  -3.251403 -3.356963 -1.221996
H  -2.115572 -3.500217 -3.41674
H  2.651543 3.673923 2.429478
H  2.128116 5.256686 1.84304
H  4.114788 5.338743 0.308873
H  4.589618 5.14377 1.993267
H  4.635441 3.755688 0.909701
H  4.268332 -3.371884 -0.841288
H  1.263941 -0.310052 -0.696654
H  5.789961 -1.933189 0.466522
H  2.779647 1.103041 0.619914
H  5.043922 0.309795 1.216103
elementType: Si F O C H
totalener: -1510.05475919 hartree
nucrepener: 2891.27452248 hartree
electener: -4401.32928167 hartree
oneelecener: -7812.77591543 hartree
twoeener: 3411.44663376 hartree
cpcmener: -0.02681867 hartree
kineticenergy: 1503.91779619 hartree
xcener: -135.231929696614 hartree
chargesum: 0.0000000
charge: 0.499401 -0.221248 -0.345693 -0.338188 -0.267672 -0.130425 -0.183870 -0.452798 -0.427429 -0.092708 -0.138014 -0.092029 0.047387 -0.241111 -0.328994 0.355594 -0.236179 -0.246009 0.237954 -0.139669 0.160522 0.048318 -0.273544 0.325890 -0.274040 -0.255052 -0.092108 -0.070527 -0.249577 0.089028 0.080793 0.087071 0.077158 0.107507 0.111889 0.104731 0.101445 0.103835 0.102392 0.095390 0.086050 0.145896 0.136406 0.141128 0.139690 0.147504 0.145571 0.151316 0.099486 0.110196 0.088241 0.091369 0.085386 0.146679 0.157072 0.161024 0.171360 0.156204
qa: 0.4994 -0.2212 -0.3457 -0.3382 -0.2677 -0.1304 -0.1839 -0.4528 -0.4274 -0.0927 -0.1380 -0.0920 0.0474 -0.2411 -0.3290 0.3556 -0.2362 -0.2460 0.2380 -0.1397 0.1605 0.0483 -0.2735 0.3259 -0.2740 -0.2551 -0.0921 -0.0705 -0.2496 0.0890 0.0808 0.0871 0.0772 0.1075 0.1119 0.1047 0.1014 0.1038 0.1024 0.0954 0.0860 0.1459 0.1364 0.1411 0.1397 0.1475 0.1456 0.1513 0.0995 0.1102 0.0882 0.0914 0.0854 0.1467 0.1571 0.1610 0.1714 0.1562
va: 4.1338 1.0620 2.0477 2.0737 3.8396 3.8625 3.7488 3.9226 3.8949 3.8512 3.8803 3.8169 3.6180 3.9067 3.9980 3.6914 3.9229 3.8804 3.6587 3.8591 4.0650 3.7850 3.9725 3.7039 4.0119 3.9572 3.8530 3.7992 3.9823 1.0160 1.0141 1.0085 1.0064 1.0081 1.0076 1.0061 1.0087 1.0084 1.0085 1.0076 1.0091 0.9886 0.9913 1.0112 1.0123 1.0036 1.0016 0.9963 0.9868 0.9875 1.0034 1.0058 1.0027 1.0082 0.9997 0.9873 0.9670 0.9949
dispcorr: -0.030914274 hartree
energy: -1510.085673463016
dipole: -12.58259 12.11410 -0.46849 22.85900 -22.07274 0.78626 23.34629 -21.29267 2.05363
magnitude: 2.24835 au
magnitude: 5.71485 debye
