program: Orca
programVersion: 5.0.2
elementType: Si F O O C C C C C C C C C C C C C C C C C C C C C C C C C H H H H H H H H H H H H H H H H H H H H H H H H H H H H H
charge: 0
multiplicity: 1
keywords: wb97x-d3
keywords: def2-TZVPP
keywords: def2/J RIJCOSX
keywords: DEFGRID2
keywords: scfconv7
keywords: smallprint printgap noloewdin
keywords: NOSOSCF
formula: C25H29FO2Si
InChI: InChI=1/C25H29FO2Si/c1-4-27-21-13-15-23(16-14-21)29(2,3)18-8-9-20-12-17-24(26)25(19-20)28-22-10-6-5-7-11-22/h5-7,10-17,19H,4,8-9,18H2,1-3H3
58 atoms
Si -3.555696 1.821076 0.200711
F  1.560328 -5.032616 -1.715012
O  2.219758 3.496031 0.954594
O  2.131373 -2.792308 -0.359735
C  -3.736551 0.046945 0.822983
C  -2.810781 -0.925697 0.093578
C  -1.751512 2.319607 0.44574
C  -4.682402 2.969498 1.180087
C  -3.970895 1.937674 -1.632363
C  -2.593048 -2.244851 0.841167
C  -1.121601 3.251385 -0.38757
C  -0.98017 1.779109 1.474677
C  -1.498939 -3.052181 0.203359
C  0.196532 3.629062 -0.200561
C  0.347025 2.138265 1.681454
C  0.942406 3.075477 0.841484
C  -0.192009 -2.574072 0.260218
C  -1.748418 -4.228703 -0.494353
C  0.835776 -3.225424 -0.398128
C  -0.719286 -4.911142 -1.131511
C  0.557794 -4.395362 -1.091329
C  3.038515 2.938443 1.976572
C  4.425328 3.513177 1.830549
C  2.42208 -1.480018 -0.639632
C  1.604509 -0.663015 -1.411515
C  3.62819 -1.003625 -0.141204
C  2.005385 0.640268 -1.673797
C  4.020695 0.295779 -0.425595
C  3.211885 1.126157 -1.190326
H  -3.511032 0.040289 1.895661
H  -4.778918 -0.275987 0.74172
H  -1.831672 -0.462203 -0.062271
H  -3.200239 -1.134392 -0.906598
H  -4.451837 2.93966 2.246923
H  -4.578466 4.00533 0.850855
H  -5.732332 2.692051 1.063149
H  -3.898065 2.963242 -1.999834
H  -3.304251 1.323381 -2.240802
H  -4.99205 1.599929 -1.821097
H  -2.324195 -2.018316 1.877109
H  -3.520827 -2.820027 0.874307
H  -1.667325 3.701332 -1.209652
H  -1.41041 1.047137 2.149842
H  0.658992 4.353252 -0.860596
H  0.892644 1.682921 2.496669
H  0.024462 -1.666669 0.813965
H  -2.75541 -4.623445 -0.542747
H  -0.911293 -5.83123 -1.668363
H  3.068842 1.848074 1.885552
H  2.624869 3.177019 2.961751
H  5.069979 3.098729 2.604899
H  4.862889 3.262463 0.863227
H  4.426069 4.597692 1.941831
H  0.66663 -1.024082 -1.812805
H  4.25698 -1.651307 0.456874
H  1.363922 1.275517 -2.270571
H  4.96379 0.660749 -0.039377
H  3.518726 2.140096 -1.407684
elementType: Si F O C H
totalener: -1510.05412692 hartree
nucrepener: 2926.71461696 hartree
electener: -4436.76874388 hartree
oneelecener: -7883.61966538 hartree
twoeener: 3446.85092150 hartree
cpcmener: -0.02791977 hartree
kineticenergy: 1503.90273519 hartree
xcener: -135.230606392937 hartree
chargesum: 0.0000000
charge: 0.489909 -0.220163 -0.336661 -0.341209 -0.270277 -0.140717 -0.158074 -0.422258 -0.442132 -0.054738 -0.086813 -0.154986 0.021162 -0.309655 -0.248761 0.338487 -0.242010 -0.200401 0.225678 -0.163914 0.174579 0.016750 -0.272820 0.337820 -0.217117 -0.254502 -0.169534 -0.146866 -0.162479 0.078516 0.095339 0.059486 0.099061 0.101100 0.100560 0.102541 0.105909 0.108543 0.111539 0.089080 0.084159 0.137622 0.143739 0.134567 0.139373 0.150458 0.143789 0.150704 0.099991 0.122703 0.094925 0.082875 0.094240 0.156242 0.145637 0.160017 0.161720 0.157268
qa: 0.4899 -0.2202 -0.3367 -0.3412 -0.2703 -0.1407 -0.1581 -0.4223 -0.4421 -0.0547 -0.0868 -0.1550 0.0212 -0.3097 -0.2488 0.3385 -0.2420 -0.2004 0.2257 -0.1639 0.1746 0.0168 -0.2728 0.3378 -0.2171 -0.2545 -0.1695 -0.1469 -0.1625 0.0785 0.0953 0.0595 0.0991 0.1011 0.1006 0.1025 0.1059 0.1085 0.1115 0.0891 0.0842 0.1376 0.1437 0.1346 0.1394 0.1505 0.1438 0.1507 0.1000 0.1227 0.0949 0.0829 0.0942 0.1562 0.1456 0.1600 0.1617 0.1573
va: 4.1331 1.0653 2.0345 2.0753 3.8683 3.8684 3.7121 3.8937 3.8956 3.7908 3.8349 3.8587 3.6611 4.0089 3.8740 3.6761 3.9269 3.9064 3.6542 3.8629 4.0728 3.7962 3.9620 3.6520 3.8727 4.0078 3.8806 3.8560 3.8033 1.0160 1.0140 0.9971 1.0092 1.0089 1.0098 1.0087 1.0090 1.0048 1.0074 1.0090 1.0135 0.9889 0.9893 1.0157 1.0125 0.9997 1.0027 0.9972 0.9796 0.9919 1.0049 1.0030 1.0046 0.9986 1.0086 0.9934 0.9875 0.9970
dispcorr: -0.033069798 hartree
energy: -1510.087196713730
dipole: -16.62837 15.69391 -0.93445 27.71361 -27.19949 0.51412 9.82009 -8.88792 0.93217
magnitude: 1.41650 au
magnitude: 3.60046 debye
