program: Orca
programVersion: 5.0.2
elementType: Si F O O C C C C C C C C C C C C C C C C C C C C C C C C C H H H H H H H H H H H H H H H H H H H H H H H H H H H H H
charge: 0
multiplicity: 1
keywords: wb97x-d3
keywords: def2-TZVPP
keywords: def2/J RIJCOSX
keywords: DEFGRID2
keywords: scfconv7
keywords: smallprint printgap noloewdin
keywords: NOSOSCF
formula: C25H29FO2Si
InChI: InChI=1/C25H29FO2Si/c1-4-27-21-13-15-23(16-14-21)29(2,3)18-8-9-20-12-17-24(26)25(19-20)28-22-10-6-5-7-11-22/h5-7,10-17,19H,4,8-9,18H2,1-3H3
58 atoms
Si -2.974766 1.226126 0.73253
F  1.178831 -3.142379 -3.388303
O  2.114989 4.506134 0.548226
O  1.898016 -2.802757 -0.844853
C  -2.357812 -0.556388 0.751486
C  -3.407565 -1.643606 0.543556
C  -1.432031 2.304409 0.653404
C  -3.973279 1.6256 2.273312
C  -4.013712 1.508228 -0.811714
C  -2.822385 -3.065486 0.543769
C  -0.994207 3.093726 1.720591
C  -0.624073 2.287608 -0.485124
C  -1.750182 -3.214002 -0.496515
C  0.187734 3.813288 1.661685
C  0.564252 3.001588 -0.570151
C  0.982166 3.768621 0.515647
C  -0.415011 -3.026401 -0.15271
C  -2.07276 -3.424853 -1.834729
C  0.573908 -2.988543 -1.124132
C  -1.088565 -3.42323 -2.812532
C  0.220578 -3.185119 -2.450505
C  3.095693 4.348408 -0.473146
C  3.868035 3.051918 -0.358688
C  2.274674 -1.883902 0.105114
C  3.424834 -2.17507 0.824899
C  1.585249 -0.696577 0.319063
C  3.885383 -1.270207 1.770635
C  2.046073 0.188061 1.284097
C  3.194558 -0.09065 2.012654
H  -1.603113 -0.618929 -0.039999
H  -1.812466 -0.729101 1.687098
H  -3.928447 -1.479644 -0.404782
H  -4.172445 -1.58935 1.323661
H  -4.851898 0.979659 2.336473
H  -3.395164 1.472463 3.186722
H  -4.33014 2.657192 2.275644
H  -3.466685 1.242401 -1.718919
H  -4.923986 0.90487 -0.79447
H  -4.317613 2.552534 -0.906089
H  -2.411449 -3.284301 1.532435
H  -3.62588 -3.783881 0.365359
H  -1.580176 3.151062 2.630906
H  -0.912268 1.693982 -1.346563
H  0.506477 4.412508 2.506094
H  1.146785 2.939875 -1.479566
H  -0.149628 -2.876028 0.88705
H  -3.104628 -3.582132 -2.123126
H  -1.33661 -3.585572 -3.85355
H  3.769388 5.194239 -0.339701
H  2.645686 4.454556 -1.46432
H  4.327174 2.951171 0.625254
H  3.249837 2.1730 -0.540685
H  4.667325 3.048537 -1.100856
H  3.956656 -3.100452 0.643521
H  0.697358 -0.4523 -0.249931
H  4.784545 -1.498367 2.327783
H  1.501635 1.107735 1.457494
H  3.548839 0.607156 2.759437
elementType: Si F O C H
totalener: -1510.05155640 hartree
nucrepener: 2942.99025466 hartree
electener: -4453.04181106 hartree
oneelecener: -7915.93311842 hartree
twoeener: 3462.89130736 hartree
cpcmener: -0.02634847 hartree
kineticenergy: 1503.91416669 hartree
xcener: -135.235691099899 hartree
chargesum: -0.0000000
charge: 0.508286 -0.221126 -0.348953 -0.343169 -0.215686 -0.161994 -0.148597 -0.450968 -0.435725 -0.088049 -0.106088 -0.196343 0.052464 -0.257880 -0.243934 0.311163 -0.252451 -0.220662 0.242373 -0.165783 0.174319 0.048893 -0.260766 0.310764 -0.267991 -0.211972 -0.097852 -0.123379 -0.235431 0.058254 0.090180 0.083050 0.083360 0.107482 0.103395 0.109443 0.106893 0.105505 0.110264 0.085144 0.093124 0.141267 0.141130 0.133716 0.142756 0.149239 0.146114 0.150606 0.109085 0.086749 0.088457 0.082409 0.101014 0.147187 0.184215 0.160455 0.150071 0.155969
qa: 0.5083 -0.2211 -0.3490 -0.3432 -0.2157 -0.1620 -0.1486 -0.4510 -0.4357 -0.0880 -0.1061 -0.1963 0.0525 -0.2579 -0.2439 0.3112 -0.2525 -0.2207 0.2424 -0.1658 0.1743 0.0489 -0.2608 0.3108 -0.2680 -0.2120 -0.0979 -0.1234 -0.2354 0.0583 0.0902 0.0831 0.0834 0.1075 0.1034 0.1094 0.1069 0.1055 0.1103 0.0851 0.0931 0.1413 0.1411 0.1337 0.1428 0.1492 0.1461 0.1506 0.1091 0.0867 0.0885 0.0824 0.1010 0.1472 0.1842 0.1605 0.1501 0.1560
va: 4.1004 1.0629 2.0543 2.0768 3.8062 3.9234 3.7191 3.9266 3.8827 3.8479 3.8613 3.8698 3.6039 4.0156 3.8270 3.7131 3.9122 3.9076 3.6394 3.8757 4.0690 3.8640 3.9129 3.7369 4.0083 3.8494 3.8578 3.7636 3.9505 1.0296 1.0144 1.0010 1.0114 1.0098 1.0087 1.0079 1.0072 1.0058 1.0087 1.0109 1.0080 0.9885 0.9951 1.0146 1.0061 1.0017 1.0007 0.9971 0.9911 0.9949 1.0068 0.9966 1.0113 1.0074 0.9757 0.9867 1.0011 0.9943
dispcorr: -0.033667148 hartree
energy: -1510.085223549411
dipole: -15.00052 14.28013 -0.72039 17.08308 -16.93466 0.14842 12.47406 -12.12490 0.34916
magnitude: 0.81419 au
magnitude: 2.06951 debye
