program: Orca
programVersion: 5.0.2
elementType: Si F O O C C C C C C C C C C C C C C C C C C C C C C C C C H H H H H H H H H H H H H H H H H H H H H H H H H H H H H
charge: 0
multiplicity: 1
keywords: wb97x-d3
keywords: def2-TZVPP
keywords: def2/J RIJCOSX
keywords: DEFGRID2
keywords: scfconv7
keywords: smallprint printgap noloewdin
keywords: NOSOSCF
formula: C25H29FO2Si
InChI: InChI=1/C25H29FO2Si/c1-4-27-21-13-15-23(16-14-21)29(2,3)18-8-9-20-12-17-24(26)25(19-20)28-22-10-6-5-7-11-22/h5-7,10-17,19H,4,8-9,18H2,1-3H3
58 atoms
Si -3.590851 1.013761 1.186272
F  1.903432 -3.650495 -0.936979
O  1.832923 2.912694 -0.721624
O  1.736739 -0.956482 -1.405518
C  -3.681388 -0.879379 1.088426
C  -4.120713 -1.470769 -0.250598
C  -1.916345 1.639378 0.595602
C  -3.780187 1.503913 2.996429
C  -4.955691 1.791885 0.150515
C  -3.154561 -1.229642 -1.410269
C  -0.78137 1.425367 1.377065
C  -1.727417 2.306687 -0.618675
C  -1.802874 -1.871852 -1.240446
C  0.483351 1.844066 0.985474
C  -0.474827 2.721898 -1.038292
C  0.645559 2.487415 -0.239116
C  -0.636763 -1.114673 -1.316038
C  -1.686425 -3.245327 -1.03525
C  0.609748 -1.710971 -1.221284
C  -0.444379 -3.852947 -0.922075
C  0.692572 -3.080569 -1.023872
C  2.975041 2.867445 0.128583
C  4.173009 3.313255 -0.67159
C  2.659002 -0.862414 -0.394578
C  3.945975 -0.499107 -0.769904
C  2.340427 -1.070938 0.94019
C  4.920065 -0.338601 0.203584
C  3.328093 -0.908069 1.902748
C  4.617865 -0.542981 1.544076
H  -2.715458 -1.29837 1.392117
H  -4.388764 -1.200784 1.86048
H  -5.093107 -1.057723 -0.531815
H  -4.281974 -2.547628 -0.14172
H  -3.705689 2.584349 3.132016
H  -4.747078 1.187293 3.393023
H  -3.010177 1.043044 3.618813
H  -5.938237 1.445591 0.477463
H  -4.949604 2.880103 0.23876
H  -4.863907 1.549009 -0.910032
H  -3.611834 -1.620343 -2.324022
H  -3.025956 -0.157282 -1.576525
H  -0.866657 0.91871 2.332584
H  -2.573942 2.507519 -1.265677
H  1.321495 1.659711 1.64263
H  -0.355722 3.231691 -1.986797
H  -0.689217 -0.044003 -1.47498
H  -2.574456 -3.861955 -0.975981
H  -0.358308 -4.921503 -0.773092
H  3.136765 1.853921 0.503856
H  2.819381 3.520388 0.99357
H  4.057795 4.33263 -1.04073
H  5.058231 3.285844 -0.036689
H  4.352537 2.653411 -1.520814
H  4.178619 -0.340014 -1.815307
H  1.335455 -1.339185 1.24115
H  5.92186 -0.054687 -0.09094
H  3.077702 -1.065438 2.943705
H  5.380012 -0.418182 2.301314
elementType: Si F O C H
totalener: -1510.05434219 hartree
nucrepener: 3030.43305542 hartree
electener: -4540.48739761 hartree
oneelecener: -8091.66125068 hartree
twoeener: 3551.17385307 hartree
cpcmener: -0.02601805 hartree
kineticenergy: 1503.92139599 hartree
xcener: -135.238921471631 hartree
chargesum: 0.0000000
charge: 0.493664 -0.220358 -0.343016 -0.337246 -0.264546 -0.157876 -0.110137 -0.467065 -0.441177 -0.098454 -0.152903 -0.123672 -0.039750 -0.277369 -0.271322 0.339614 -0.207206 -0.151505 0.138892 -0.201771 0.292452 0.088832 -0.287074 0.320425 -0.274331 -0.179850 -0.127475 -0.172545 -0.166028 0.080576 0.097836 0.088976 0.093177 0.100694 0.103581 0.101884 0.113318 0.114579 0.103077 0.103204 0.085260 0.134762 0.142268 0.142797 0.131851 0.157253 0.143008 0.149380 0.033448 0.122226 0.098830 0.093783 0.088555 0.143661 0.152274 0.157588 0.160751 0.160200
qa: 0.4937 -0.2204 -0.3430 -0.3372 -0.2645 -0.1579 -0.1101 -0.4671 -0.4412 -0.0985 -0.1529 -0.1237 -0.0398 -0.2774 -0.2713 0.3396 -0.2072 -0.1515 0.1389 -0.2018 0.2925 0.0888 -0.2871 0.3204 -0.2743 -0.1799 -0.1275 -0.1725 -0.1660 0.0806 0.0978 0.0890 0.0932 0.1007 0.1036 0.1019 0.1133 0.1146 0.1031 0.1032 0.0853 0.1348 0.1423 0.1428 0.1319 0.1573 0.1430 0.1494 0.0334 0.1222 0.0988 0.0938 0.0886 0.1437 0.1523 0.1576 0.1608 0.1602
va: 4.0787 1.0642 2.0484 2.0343 3.8340 3.8992 3.6274 3.9055 3.9083 3.7984 3.8775 3.8310 3.6894 3.8754 4.0095 3.6944 3.8667 3.8661 3.7740 3.9461 3.9331 3.7765 3.9597 3.5044 3.9313 3.8068 3.8516 3.9058 3.8492 1.0157 1.0053 1.0006 1.0021 1.0109 1.0108 1.0111 1.0074 1.0088 1.0070 1.0049 1.0120 0.9976 0.9881 1.0052 1.0150 0.9949 1.0017 0.9996 0.9911 0.9977 1.0065 1.0052 1.0037 1.0121 1.0061 0.9903 0.9900 0.9883
dispcorr: -0.036604817 hartree
energy: -1510.090947006102
dipole: -17.68274 17.04381 -0.63894 17.43070 -17.50736 -0.07666 10.53374 -9.53592 0.99782
magnitude: 1.18734 au
magnitude: 3.01797 debye
