program: Orca
programVersion: 5.0.2
elementType: Si F O O C C C C C C C C C C C C C C C C C C C C C C C C C H H H H H H H H H H H H H H H H H H H H H H H H H H H H H
charge: 0
multiplicity: 1
keywords: wb97x-d3
keywords: def2-TZVPP
keywords: def2/J RIJCOSX
keywords: DEFGRID2
keywords: scfconv7
keywords: smallprint printgap noloewdin
keywords: NOSOSCF
formula: C25H29FO2Si
InChI: InChI=1/C25H29FO2Si/c1-4-27-21-13-15-23(16-14-21)29(2,3)18-8-9-20-12-17-24(26)25(19-20)28-22-10-6-5-7-11-22/h5-7,10-17,19H,4,8-9,18H2,1-3H3
58 atoms
Si -4.082339 1.529472 0.838795
F  2.101834 -3.863646 -1.047191
O  1.955357 2.01288 1.079637
O  1.834055 -1.57276 0.44266
C  -4.537444 -0.312794 1.028175
C  -3.402293 -1.306293 0.785506
C  -2.21091 1.751217 0.897156
C  -4.85561 2.481306 2.267504
C  -4.724785 2.193983 -0.80023
C  -2.902368 -1.328506 -0.660934
C  -1.479494 1.503017 2.065115
C  -1.477686 2.123845 -0.228131
C  -1.577049 -2.023992 -0.799616
C  -0.100237 1.607011 2.1028
C  -0.091584 2.238748 -0.216008
C  0.6110 1.968804 0.955493
C  -0.455321 -1.475934 -0.177509
C  -1.423816 -3.202942 -1.518679
C  0.777205 -2.092561 -0.254811
C  -0.185509 -3.829861 -1.614435
C  0.899803 -3.273725 -0.976319
C  2.752805 2.50326 0.004805
C  2.728228 4.012666 -0.099595
C  2.941011 -1.123296 -0.228884
C  2.949604 -0.843004 -1.588208
C  4.080032 -0.928986 0.54348
C  4.120217 -0.374587 -2.172322
C  5.236889 -0.45582 -0.054169
C  5.265889 -0.178943 -1.4157
H  -4.924924 -0.458422 2.041471
H  -5.378382 -0.532101 0.360528
H  -3.720697 -2.317021 1.058129
H  -2.569872 -1.067574 1.452447
H  -4.669224 3.553946 2.188593
H  -5.937994 2.337793 2.297664
H  -4.459098 2.148827 3.22927
H  -4.33336 1.633777 -1.652146
H  -5.813669 2.117144 -0.840647
H  -4.468366 3.244668 -0.94847
H  -3.646098 -1.808648 -1.30097
H  -2.796801 -0.304668 -1.033009
H  -1.991603 1.213439 2.976556
H  -1.986848 2.33182 -1.162297
H  0.438278 1.400952 3.01994
H  0.411943 2.532187 -1.12702
H  -0.541025 -0.558993 0.392915
H  -2.277762 -3.646722 -2.014596
H  -0.069118 -4.74939 -2.173438
H  2.462401 2.034273 -0.939111
H  3.763237 2.162798 0.230076
H  1.739639 4.401989 -0.343078
H  3.059602 4.476892 0.829548
H  3.409804 4.327678 -0.890422
H  2.063362 -0.971925 -2.196454
H  4.057077 -1.149424 1.603194
H  4.126813 -0.158371 -3.232597
H  6.122136 -0.307723 0.550303
H  6.172278 0.185128 -1.880166
elementType: Si F O C H
totalener: -1510.05115211 hartree
nucrepener: 2990.34079561 hartree
electener: -4500.39194771 hartree
oneelecener: -8011.53966533 hartree
twoeener: 3511.14771762 hartree
cpcmener: -0.02652883 hartree
kineticenergy: 1503.90679198 hartree
xcener: -135.234916864055 hartree
chargesum: 0.0000000
charge: 0.494695 -0.219254 -0.350979 -0.330232 -0.293007 -0.113030 -0.111419 -0.458710 -0.433220 -0.107021 -0.136255 -0.186964 -0.008050 -0.263473 -0.210559 0.320672 -0.134476 -0.140003 0.083110 -0.189724 0.279174 0.026582 -0.269646 0.307484 -0.186767 -0.250496 -0.169810 -0.137460 -0.180380 0.099842 0.086213 0.091532 0.080179 0.100696 0.103701 0.101053 0.103723 0.110152 0.107457 0.096306 0.088700 0.137935 0.149027 0.132578 0.141513 0.080898 0.142221 0.149671 0.091427 0.118729 0.093375 0.090888 0.096487 0.151093 0.144010 0.161514 0.158348 0.159952
qa: 0.4947 -0.2193 -0.3510 -0.3302 -0.2930 -0.1130 -0.1114 -0.4587 -0.4332 -0.1070 -0.1363 -0.1870 -0.0080 -0.2635 -0.2106 0.3207 -0.1345 -0.1400 0.0831 -0.1897 0.2792 0.0266 -0.2696 0.3075 -0.1868 -0.2505 -0.1698 -0.1375 -0.1804 0.0998 0.0862 0.0915 0.0802 0.1007 0.1037 0.1011 0.1037 0.1102 0.1075 0.0963 0.0887 0.1379 0.1490 0.1326 0.1415 0.0809 0.1422 0.1497 0.0914 0.1187 0.0934 0.0909 0.0965 0.1511 0.1440 0.1615 0.1583 0.1600
va: 4.0591 1.0668 2.0190 2.0457 3.8700 3.8445 3.6708 3.9010 3.8988 3.7631 3.8626 3.8639 3.6677 4.0186 3.8522 3.6710 3.8509 3.8665 3.8259 3.9284 3.9525 3.8414 3.9753 3.5709 3.8236 3.9532 3.9053 3.8726 3.8671 1.0064 1.0093 1.0076 1.0076 1.0113 1.0092 1.0112 1.0093 1.0103 1.0079 1.0146 1.0179 0.9921 0.9881 1.0154 1.0057 1.0236 1.0027 0.9989 0.9866 0.9868 1.0017 1.0045 1.0070 1.0058 1.0110 0.9901 0.9897 0.9896
dispcorr: -0.034922983 hartree
energy: -1510.086075088507
dipole: -22.02466 21.26087 -0.76380 24.56464 -23.86025 0.70439 1.24159 -2.43066 -1.18907
magnitude: 1.57906 au
magnitude: 4.01366 debye
