program: Orca
programVersion: 5.0.2
elementType: Si F O O C C C C C C C C C C C C C C C C C C C C C C C C C H H H H H H H H H H H H H H H H H H H H H H H H H H H H H
charge: 0
multiplicity: 1
keywords: wb97x-d3
keywords: def2-TZVPP
keywords: def2/J RIJCOSX
keywords: DEFGRID2
keywords: scfconv7
keywords: smallprint printgap noloewdin
keywords: NOSOSCF
formula: C25H29FO2Si
InChI: InChI=1/C25H29FO2Si/c1-4-27-21-13-15-23(16-14-21)29(2,3)18-8-9-20-12-17-24(26)25(19-20)28-22-10-6-5-7-11-22/h5-7,10-17,19H,4,8-9,18H2,1-3H3
58 atoms
Si -3.725471 1.14391 0.506256
F  0.879042 -3.588074 -2.483366
O  1.97727 3.013474 -0.292852
O  1.454159 -1.138059 -1.548487
C  -3.907564 -0.73983 0.415324
C  -3.504099 -1.556874 1.643971
C  -1.949245 1.731191 0.298598
C  -4.387596 1.759518 2.157641
C  -4.734748 1.863437 -0.914075
C  -2.00025 -1.607925 1.924588
C  -1.269019 1.575691 -0.915517
C  -1.249714 2.35386 1.329583
C  -1.200231 -2.16138 0.775779
C  0.033728 2.005832 -1.086019
C  0.060437 2.796489 1.183745
C  0.716185 2.619518 -0.031868
C  -0.185669 -1.411907 0.192141
C  -1.482411 -3.420683 0.245366
C  0.513574 -1.891056 -0.906536
C  -0.789143 -3.911889 -0.849245
C  0.204244 -3.139329 -1.416827
C  2.742196 3.673687 0.70893
C  3.315828 2.732304 1.74675
C  2.650346 -0.880397 -0.94379
C  3.430207 0.106214 -1.53766
C  3.105114 -1.558075 0.180021
C  4.67273 0.408009 -1.005672
C  4.351345 -1.237436 0.70477
C  5.140551 -0.2586 0.120417
H  -4.971467 -0.917586 0.218342
H  -3.392034 -1.112859 -0.476713
H  -3.872944 -2.581111 1.531536
H  -4.004546 -1.165301 2.534296
H  -4.399257 2.850273 2.209112
H  -5.414649 1.419759 2.310897
H  -3.801926 1.399166 3.005961
H  -4.677442 2.953794 -0.935625
H  -4.381953 1.500799 -1.882354
H  -5.790026 1.59202 -0.834716
H  -1.628676 -0.610824 2.172529
H  -1.835707 -2.222861 2.814585
H  -1.75957 1.099898 -1.758196
H  -1.723771 2.510112 2.291977
H  0.533147 1.873887 -2.038389
H  0.542148 3.275088 2.025581
H  0.059315 -0.431864 0.58432
H  -2.263005 -4.030751 0.68306
H  -1.016327 -4.887501 -1.26007
H  2.155571 4.470927 1.176221
H  3.553577 4.156438 0.163578
H  3.950194 3.299861 2.42939
H  2.551065 2.237303 2.344958
H  3.932826 1.96341 1.281704
H  3.065118 0.625384 -2.415057
H  2.510892 -2.33222 0.648122
H  5.274737 1.177535 -1.471704
H  4.702998 -1.766882 1.58106
H  6.108302 -0.014415 0.538127
elementType: Si F O C H
totalener: -1510.06665639 hartree
nucrepener: 3010.16279507 hartree
electener: -4520.22945145 hartree
oneelecener: -8051.19357463 hartree
twoeener: 3530.96412317 hartree
cpcmener: -0.02303263 hartree
kineticenergy: 1503.91243926 hartree
xcener: -135.236302274572 hartree
chargesum: 0.0000000
charge: 0.493898 -0.216611 -0.334641 -0.326533 -0.266925 -0.161492 -0.168691 -0.450205 -0.447061 -0.095766 -0.080068 -0.154610 -0.022513 -0.341388 -0.228976 0.378202 -0.163286 -0.173807 0.174358 -0.191688 0.228592 0.034042 -0.257138 0.328615 -0.274122 -0.192725 -0.134334 -0.157887 -0.181003 0.098783 0.081293 0.093402 0.088213 0.113410 0.112668 0.100705 0.101809 0.100214 0.101936 0.082620 0.101303 0.128246 0.141836 0.134416 0.136964 0.143435 0.139800 0.147525 0.093538 0.110980 0.098471 0.091727 0.074334 0.146980 0.148628 0.155651 0.157536 0.157341
qa: 0.4939 -0.2166 -0.3346 -0.3265 -0.2669 -0.1615 -0.1687 -0.4502 -0.4471 -0.0958 -0.0801 -0.1546 -0.0225 -0.3414 -0.2290 0.3782 -0.1633 -0.1738 0.1744 -0.1917 0.2286 0.0340 -0.2571 0.3286 -0.2741 -0.1927 -0.1343 -0.1579 -0.1810 0.0988 0.0813 0.0934 0.0882 0.1134 0.1127 0.1007 0.1018 0.1002 0.1019 0.0826 0.1013 0.1282 0.1418 0.1344 0.1370 0.1434 0.1398 0.1475 0.0935 0.1110 0.0985 0.0917 0.0743 0.1470 0.1486 0.1557 0.1575 0.1573
va: 4.1217 1.0723 2.0609 2.0651 3.8446 3.8950 3.6988 3.9180 3.9030 3.8131 3.8008 3.8606 3.6897 3.9952 3.9111 3.6864 3.8926 3.8696 3.6442 3.9005 4.0794 3.8478 3.9028 3.6489 3.9249 3.8868 3.8411 3.9030 3.8496 1.0056 1.0140 1.0003 1.0017 1.0088 1.0070 1.0046 1.0087 1.0102 1.0099 1.0115 1.0055 0.9978 0.9899 1.0149 1.0048 0.9952 1.0026 0.9990 0.9995 0.9920 1.0133 1.0036 1.0135 1.0078 1.0050 0.9914 0.9911 0.9911
dispcorr: -0.035568801 hartree
energy: -1510.102225185779
dipole: -15.69837 15.40588 -0.29249 18.05428 -17.67851 0.37577 20.16028 -18.25017 1.91012
magnitude: 1.96858 au
magnitude: 5.00373 debye
