program: Orca
programVersion: 5.0.2
elementType: Si F O O C C C C C C C C C C C C C C C C C C C C C C C C C H H H H H H H H H H H H H H H H H H H H H H H H H H H H H
charge: 0
multiplicity: 1
keywords: wb97x-d3
keywords: def2-TZVPP
keywords: def2/J RIJCOSX
keywords: DEFGRID2
keywords: scfconv7
keywords: smallprint printgap noloewdin
keywords: NOSOSCF
formula: C25H29FO2Si
InChI: InChI=1/C25H29FO2Si/c1-4-27-21-13-15-23(16-14-21)29(2,3)18-8-9-20-12-17-24(26)25(19-20)28-22-10-6-5-7-11-22/h5-7,10-17,19H,4,8-9,18H2,1-3H3
58 atoms
Si -3.688736 1.135643 1.042407
F  1.720588 -4.10279 -0.218452
O  1.870694 2.885809 -0.570153
O  1.445528 -1.571455 0.743947
C  -3.75919 -0.757154 0.881018
C  -4.009508 -1.333589 -0.514288
C  -1.979066 1.797752 0.610996
C  -4.061084 1.569719 2.837196
C  -4.967615 1.91604 -0.097183
C  -2.878506 -1.139431 -1.531195
C  -0.904186 1.63918 1.48608
C  -1.692926 2.371724 -0.632166
C  -1.638073 -1.923129 -1.202757
C  0.396479 1.994109 1.147275
C  -0.408924 2.736527 -0.99238
C  0.655331 2.536978 -0.110443
C  -0.622268 -1.367392 -0.429107
C  -1.485909 -3.234807 -1.645284
C  0.498215 -2.102726 -0.086171
C  -0.358034 -3.978564 -1.324745
C  0.623488 -3.405316 -0.544964
C  3.02208 2.731359 0.251168
C  3.179021 3.847002 1.2623
C  2.638169 -1.159866 0.219393
C  3.678309 -0.984821 1.125396
C  2.823763 -0.889986 -1.130089
C  4.912493 -0.547218 0.672423
C  4.069013 -0.455503 -1.567543
C  5.117898 -0.28455 -0.6765
H  -2.854921 -1.190739 1.322605
H  -4.575399 -1.085021 1.535317
H  -4.917177 -0.888751 -0.932045
H  -4.21681 -2.405869 -0.434836
H  -3.361872 1.091201 3.526803
H  -4.004652 2.646186 3.011923
H  -5.064206 1.244545 3.122591
H  -5.969596 1.545696 0.131835
H  -4.992982 3.002489 0.012122
H  -4.779472 1.699464 -1.150789
H  -3.244115 -1.451166 -2.512508
H  -2.632136 -0.078677 -1.620352
H  -1.062907 1.2042 2.467265
H  -2.486543 2.532293 -1.353522
H  1.184553 1.831816 1.870331
H  -0.216406 3.171912 -1.96585
H  -0.700376 -0.347002 -0.077223
H  -2.256136 -3.688811 -2.256969
H  -0.242827 -4.995532 -1.67765
H  3.862601 2.741947 -0.442897
H  3.023121 1.751685 0.737028
H  2.370621 3.872201 1.99335
H  4.112272 3.704711 1.809193
H  3.226345 4.819983 0.771781
H  3.517574 -1.193687 2.175917
H  2.017732 -1.009648 -1.842929
H  5.720288 -0.416026 1.381002
H  4.21225 -0.248276 -2.620384
H  6.08422 0.052547 -1.027556
elementType: Si F O C H
totalener: -1510.06761386 hartree
nucrepener: 3002.42528297 hartree
electener: -4512.49289683 hartree
oneelecener: -8035.38523529 hartree
twoeener: 3522.89233846 hartree
cpcmener: -0.02164026 hartree
kineticenergy: 1503.90789488 hartree
xcener: -135.234934838951 hartree
chargesum: -0.0000000
charge: 0.496689 -0.217833 -0.335458 -0.319839 -0.277356 -0.156530 -0.116006 -0.459578 -0.439038 -0.115123 -0.156184 -0.121032 -0.020713 -0.236732 -0.279283 0.332875 -0.103714 -0.136154 0.092867 -0.214608 0.305362 0.078681 -0.270338 0.263177 -0.227446 -0.168327 -0.112409 -0.139865 -0.211691 0.083299 0.098741 0.084685 0.091889 0.101493 0.101711 0.102681 0.112090 0.114765 0.100335 0.096551 0.091759 0.131213 0.144141 0.138566 0.132213 0.060725 0.142083 0.146257 0.116904 0.041753 0.091721 0.093099 0.092124 0.139596 0.149076 0.154490 0.156298 0.155348
qa: 0.4967 -0.2178 -0.3355 -0.3198 -0.2774 -0.1565 -0.1160 -0.4596 -0.4390 -0.1151 -0.1562 -0.1210 -0.0207 -0.2367 -0.2793 0.3329 -0.1037 -0.1362 0.0929 -0.2146 0.3054 0.0787 -0.2703 0.2632 -0.2274 -0.1683 -0.1124 -0.1399 -0.2117 0.0833 0.0987 0.0847 0.0919 0.1015 0.1017 0.1027 0.1121 0.1148 0.1003 0.0966 0.0918 0.1312 0.1441 0.1386 0.1322 0.0607 0.1421 0.1463 0.1169 0.0418 0.0917 0.0931 0.0921 0.1396 0.1491 0.1545 0.1563 0.1553
va: 4.1072 1.0703 2.0562 2.0568 3.8255 3.9143 3.6436 3.9085 3.9037 3.8033 3.8635 3.8509 3.6865 3.8263 4.0660 3.7111 3.7357 3.8617 3.8232 3.9509 3.9685 3.8366 3.9599 3.6102 3.9374 3.8276 3.8575 3.8786 3.8886 1.0131 1.0075 1.0010 1.0025 1.0113 1.0109 1.0105 1.0067 1.0088 1.0067 1.0105 1.0154 0.9979 0.9866 1.0025 1.0150 1.0396 0.9994 0.9999 0.9894 1.0114 1.0009 1.0081 1.0057 1.0121 1.0049 0.9902 0.9910 0.9926
dispcorr: -0.035199607 hartree
energy: -1510.102813468640
dipole: -18.32336 17.99507 -0.32829 21.33672 -21.07385 0.26287 5.08933 -5.28040 -0.19107
magnitude: 0.46193 au
magnitude: 1.17413 debye
