program: Orca
programVersion: 5.0.2
elementType: Si F O O C C C C C C C C C C C C C C C C C C C C C C C C C H H H H H H H H H H H H H H H H H H H H H H H H H H H H H
charge: 0
multiplicity: 1
keywords: wb97x-d3
keywords: def2-TZVPP
keywords: def2/J RIJCOSX
keywords: DEFGRID2
keywords: scfconv7
keywords: smallprint printgap noloewdin
keywords: NOSOSCF
formula: C25H29FO2Si
InChI: InChI=1/C25H29FO2Si/c1-4-27-21-13-15-23(16-14-21)29(2,3)18-8-9-20-12-17-24(26)25(19-20)28-22-10-6-5-7-11-22/h5-7,10-17,19H,4,8-9,18H2,1-3H3
58 atoms
Si -3.383899 1.859111 0.28373
F  1.076798 -5.464155 -2.103234
O  2.190206 3.834348 1.566073
O  2.079218 -3.301945 -0.87247
C  -3.459523 0.094374 0.962344
C  -2.51045 -0.859703 0.241943
C  -1.673451 2.552234 0.660203
C  -4.69259 2.915074 1.126394
C  -3.654634 1.84496 -1.57922
C  -2.366121 -2.218933 0.931014
C  -0.565293 2.26781 -0.148766
C  -1.431679 3.310789 1.804049
C  -1.447155 -3.131803 0.168168
C  0.706742 2.704372 0.170599
C  -0.162612 3.765524 2.145457
C  0.920845 3.456436 1.327496
C  -0.099413 -2.803762 0.036379
C  -1.916857 -4.278733 -0.46333
C  0.752031 -3.579903 -0.733104
C  -1.068718 -5.078901 -1.217073
C  0.252769 -4.715626 -1.356359
C  2.481302 4.587129 2.736023
C  3.968981 4.833263 2.773496
C  2.472843 -2.031871 -1.199882
C  1.720836 -1.200637 -2.021774
C  3.70164 -1.614798 -0.706518
C  2.211997 0.057423 -2.341569
C  4.181791 -0.357263 -1.041254
C  3.439312 0.487068 -1.855156
H  -3.2125 0.133899 2.029785
H  -4.486622 -0.282774 0.905871
H  -1.515806 -0.409774 0.160142
H  -2.854227 -1.015571 -0.785006
H  -4.642407 3.958442 0.807963
H  -5.694499 2.55081 0.887442
H  -4.599532 2.898198 2.214272
H  -2.881254 1.285525 -2.109444
H  -4.613238 1.386526 -1.83345
H  -3.659433 2.857519 -1.988596
H  -1.984462 -2.06379 1.944628
H  -3.347917 -2.687103 1.03589
H  -0.688745 1.688248 -1.057215
H  -2.249683 3.567639 2.468167
H  1.546635 2.46429 -0.470763
H  -0.042134 4.353172 3.045664
H  0.29201 -1.921197 0.530537
H  -2.959094 -4.557092 -0.369752
H  -1.435232 -5.972451 -1.706164
H  2.164056 4.03858 3.629368
H  1.937202 5.537735 2.72054
H  4.528636 3.898469 2.821277
H  4.305468 5.395512 1.901712
H  4.217109 5.415602 3.66102
H  0.765619 -1.52118 -2.417972
H  4.277075 -2.272772 -0.067193
H  1.627115 0.703419 -2.983924
H  5.140646 -0.036138 -0.655146
H  3.814946 1.468878 -2.111685
elementType: Si F O C H
totalener: -1510.07148867 hartree
nucrepener: 2825.55075545 hartree
electener: -4335.62224412 hartree
oneelecener: -7681.26040490 hartree
twoeener: 3345.63816078 hartree
cpcmener: -0.02404780 hartree
kineticenergy: 1503.90839626 hartree
xcener: -135.227778966251 hartree
chargesum: 0.0000000
charge: 0.494098 -0.217321 -0.323584 -0.331621 -0.253458 -0.100568 -0.151401 -0.460544 -0.424910 -0.063681 -0.133498 -0.143785 -0.006183 -0.260029 -0.257379 0.329918 -0.194166 -0.186918 0.173840 -0.173270 0.194657 0.063284 -0.273752 0.290415 -0.175060 -0.247912 -0.174118 -0.107625 -0.195664 0.075489 0.084599 0.058010 0.087388 0.106372 0.105495 0.100032 0.099373 0.107491 0.108828 0.091165 0.078585 0.144861 0.137017 0.131048 0.135832 0.146774 0.140253 0.147502 0.091852 0.093260 0.087039 0.087339 0.088919 0.152793 0.145169 0.160948 0.157401 0.159400
qa: 0.4941 -0.2173 -0.3236 -0.3316 -0.2535 -0.1006 -0.1514 -0.4605 -0.4249 -0.0637 -0.1335 -0.1438 -0.0062 -0.2600 -0.2574 0.3299 -0.1942 -0.1869 0.1738 -0.1733 0.1947 0.0633 -0.2738 0.2904 -0.1751 -0.2479 -0.1741 -0.1076 -0.1957 0.0755 0.0846 0.0580 0.0874 0.1064 0.1055 0.1000 0.0994 0.1075 0.1088 0.0912 0.0786 0.1449 0.1370 0.1310 0.1358 0.1468 0.1403 0.1475 0.0919 0.0933 0.0870 0.0873 0.0889 0.1528 0.1452 0.1609 0.1574 0.1594
va: 4.1371 1.0692 2.0855 2.0780 3.8399 3.8747 3.7636 3.9260 3.8849 3.8091 3.8761 3.9287 3.6946 4.0154 3.8947 3.8235 3.9023 3.8972 3.7085 3.8830 4.0593 3.7991 3.9751 3.6883 3.8554 4.0058 3.8600 3.8816 3.8726 1.0168 1.0140 1.0086 1.0049 1.0098 1.0110 1.0107 1.0096 1.0066 1.0086 1.0063 1.0145 0.9821 0.9913 1.0262 1.0131 1.0024 1.0032 0.9987 0.9863 0.9859 1.0036 1.0033 1.0059 0.9996 1.0080 0.9897 0.9883 0.9898
dispcorr: -0.028618599 hartree
energy: -1510.100107267210
dipole: -15.89193 14.95261 -0.93932 33.91289 -32.50778 1.40511 13.62392 -12.51983 1.10408
magnitude: 2.01882 au
magnitude: 5.13144 debye
