program: Orca
programVersion: 5.0.2
elementType: Si F O O C C C C C C C C C C C C C C C C C C C C C C C C C H H H H H H H H H H H H H H H H H H H H H H H H H H H H H
charge: 0
multiplicity: 1
keywords: wb97x-d3
keywords: def2-TZVPP
keywords: def2/J RIJCOSX
keywords: DEFGRID2
keywords: scfconv7
keywords: smallprint printgap noloewdin
keywords: NOSOSCF
formula: C25H29FO2Si
InChI: InChI=1/C25H29FO2Si/c1-4-27-21-13-15-23(16-14-21)29(2,3)18-8-9-20-12-17-24(26)25(19-20)28-22-10-6-5-7-11-22/h5-7,10-17,19H,4,8-9,18H2,1-3H3
58 atoms
Si -0.985152 0.582883 2.028272
F  -0.142384 -6.011326 -1.32942
O  -1.220079 6.57492 1.221817
O  1.618849 -4.13371 -2.035203
C  -1.872862 -0.276864 0.595667
C  -1.366409 0.141081 -0.783451
C  -1.0153 2.449306 1.786394
C  0.801954 -0.010762 2.063563
C  -1.836974 0.150527 3.649255
C  -1.91288 -0.712675 -1.934354
C  -2.048987 3.239608 2.303575
C  -0.026856 3.110783 1.058814
C  -1.474222 -2.146332 -1.83112
C  -2.095861 4.606731 2.103956
C  -0.05097 4.484662 0.843745
C  -1.094524 5.243421 1.367798
C  -0.13209 -2.468655 -2.018935
C  -2.361819 -3.161854 -1.491803
C  0.321613 -3.765735 -1.842428
C  -1.924061 -4.470577 -1.333497
C  -0.587028 -4.757492 -1.497723
C  -0.243054 7.290815 0.477879
C  -0.648916 8.743714 0.460019
C  2.625416 -3.355109 -1.529328
C  2.519275 -2.692254 -0.312295
C  3.796714 -3.291289 -2.270867
C  3.598307 -1.952403 0.1504
C  4.870815 -2.557161 -1.788975
C  4.775719 -1.878858 -0.581663
H  -1.744528 -1.35622 0.739085
H  -2.950958 -0.094767 0.664522
H  -0.272386 0.104936 -0.817702
H  -1.63461 1.184425 -0.969537
H  1.384063 0.494149 2.837279
H  0.841067 -1.082279 2.273229
H  1.311605 0.153084 1.112041
H  -1.783221 -0.923495 3.841529
H  -1.372646 0.656722 4.498106
H  -2.894896 0.421198 3.645356
H  -3.004354 -0.659714 -1.943856
H  -1.569484 -0.289229 -2.882409
H  -2.845143 2.784479 2.882578
H  0.803852 2.553605 0.639649
H  -2.906826 5.194453 2.517687
H  0.746736 4.939328 0.271528
H  0.573367 -1.69334 -2.296602
H  -3.409966 -2.933983 -1.343832
H  -2.615105 -5.260104 -1.066867
H  -0.181142 6.899895 -0.543368
H  0.744297 7.17495 0.937571
H  0.084972 9.318725 -0.104655
H  -1.619465 8.88291 -0.01762
H  -0.694983 9.159843 1.467009
H  1.611595 -2.746437 0.275797
H  3.865738 -3.816349 -3.215442
H  3.513938 -1.434394 1.097404
H  5.783392 -2.510536 -2.369167
H  5.612456 -1.300479 -0.212666
elementType: Si F O C H
totalener: -1510.07130134 hartree
nucrepener: 2765.23361027 hartree
electener: -4275.30491161 hartree
oneelecener: -7560.24233106 hartree
twoeener: 3284.93741945 hartree
cpcmener: -0.02367093 hartree
kineticenergy: 1503.90865190 hartree
xcener: -135.228696555882 hartree
chargesum: 0.0000000
charge: 0.492854 -0.217793 -0.324995 -0.331145 -0.235790 -0.141475 -0.168271 -0.432086 -0.458673 -0.092963 -0.093838 -0.154346 0.003734 -0.290142 -0.250719 0.341467 -0.196380 -0.197876 0.189793 -0.157288 0.185390 0.062019 -0.273267 0.282953 -0.184263 -0.246786 -0.151620 -0.121234 -0.193605 0.080027 0.084801 0.079747 0.088544 0.117499 0.110173 0.089698 0.104365 0.104878 0.099456 0.081554 0.098922 0.135848 0.142211 0.133434 0.136486 0.146056 0.140245 0.148175 0.092960 0.093369 0.088863 0.087080 0.087256 0.155980 0.145632 0.167616 0.157270 0.158201
qa: 0.4929 -0.2178 -0.3250 -0.3311 -0.2358 -0.1415 -0.1683 -0.4321 -0.4587 -0.0930 -0.0938 -0.1543 0.0037 -0.2901 -0.2507 0.3415 -0.1964 -0.1979 0.1898 -0.1573 0.1854 0.0620 -0.2733 0.2830 -0.1843 -0.2468 -0.1516 -0.1212 -0.1936 0.0800 0.0848 0.0797 0.0885 0.1175 0.1102 0.0897 0.1044 0.1049 0.0995 0.0816 0.0989 0.1358 0.1422 0.1334 0.1365 0.1461 0.1402 0.1482 0.0930 0.0934 0.0889 0.0871 0.0873 0.1560 0.1456 0.1676 0.1573 0.1582
va: 4.1454 1.0683 2.0815 2.0801 3.7972 3.8828 3.7608 3.8980 3.9242 3.8611 3.8695 3.8954 3.6547 4.0446 3.9097 3.7577 3.8960 3.8688 3.6928 3.8741 4.0642 3.8005 3.9750 3.7274 3.8825 4.0004 3.8805 3.8925 3.9372 1.0155 1.0155 1.0017 1.0093 1.0071 1.0038 1.0070 1.0105 1.0098 1.0121 1.0108 1.0054 0.9897 0.9872 1.0147 1.0134 1.0036 1.0040 0.9975 0.9863 0.9862 1.0058 1.0036 1.0035 0.9971 1.0078 0.9858 0.9887 0.9912
dispcorr: -0.028658103 hartree
energy: -1510.099959446459
dipole: -4.32149 4.49023 0.16875 37.37436 -35.65509 1.71927 12.12876 -12.31512 -0.18636
magnitude: 1.73755 au
magnitude: 4.41651 debye
