program: Orca
programVersion: 5.0.2
elementType: Si F O O C C C C C C C C C C C C C C C C C C C C C C C C C H H H H H H H H H H H H H H H H H H H H H H H H H H H H H
charge: 0
multiplicity: 1
keywords: wb97x-d3
keywords: def2-TZVPP
keywords: def2/J RIJCOSX
keywords: DEFGRID2
keywords: scfconv7
keywords: smallprint printgap noloewdin
keywords: NOSOSCF
formula: C25H29FO2Si
InChI: InChI=1/C25H29FO2Si/c1-4-27-21-13-15-23(16-14-21)29(2,3)18-8-9-20-12-17-24(26)25(19-20)28-22-10-6-5-7-11-22/h5-7,10-17,19H,4,8-9,18H2,1-3H3
58 atoms
Si -3.432352 0.545405 0.605631
F  3.652471 -1.354459 0.048311
O  0.447836 2.753974 4.691755
O  2.148665 -2.699328 -1.696355
C  -2.390665 0.281703 -0.946655
C  -1.746809 1.565562 -1.468514
C  -2.274867 1.242605 1.918957
C  -4.149169 -1.101064 1.173676
C  -4.827295 1.768732 0.288603
C  -0.604111 1.327673 -2.46243
C  -2.643791 2.277146 2.775243
C  -0.969189 0.750784 2.0531
C  0.562069 0.623223 -1.826045
C  -1.772914 2.809104 3.721472
C  -0.083608 1.265011 2.980745
C  -0.479272 2.305395 3.825418
C  0.824541 -0.713325 -2.104872
C  1.366137 1.28117 -0.896729
C  1.87313 -1.382283 -1.485902
C  2.404435 0.620587 -0.258575
C  2.651204 -0.702659 -0.561677
C  0.107646 3.794962 5.59732
C  1.319208 4.085211 6.447956
C  2.075639 -3.212006 -2.964735
C  2.532028 -2.51236 -4.075357
C  1.566538 -4.495978 -3.095498
C  2.45901 -3.107841 -5.326179
C  1.512677 -5.083473 -4.351401
C  1.949083 -4.391162 -5.472308
H  -1.621203 -0.458441 -0.697937
H  -2.99515 -0.183249 -1.732765
H  -1.356787 2.16433 -0.639143
H  -2.507593 2.185707 -1.950187
H  -4.753412 -0.983436 2.075995
H  -4.789741 -1.545297 0.408103
H  -3.363156 -1.824549 1.400981
H  -5.458873 1.426586 -0.534794
H  -5.475908 1.884611 1.159574
H  -4.456862 2.760563 0.02192
H  -0.969527 0.745215 -3.311861
H  -0.27465 2.290974 -2.861449
H  -3.639371 2.702763 2.715472
H  -0.620395 -0.0534 1.41387
H  -2.118765 3.61385 4.356377
H  0.922337 0.869131 3.056807
H  0.199263 -1.242043 -2.814995
H  1.179488 2.321396 -0.659499
H  3.027564 1.130923 0.464977
H  -0.736023 3.490432 6.225989
H  -0.195328 4.692772 5.047981
H  1.082793 4.880486 7.154971
H  1.625591 3.209821 7.021832
H  2.164238 4.417316 5.843765
H  2.942123 -1.51517 -3.974962
H  1.218356 -5.030185 -2.220336
H  2.810292 -2.561431 -6.192046
H  1.115618 -6.085429 -4.451361
H  1.89541 -4.848436 -6.451493
elementType: Si F O C H
totalener: -1510.07109095 hartree
nucrepener: 2792.31184588 hartree
electener: -4302.38293683 hartree
oneelecener: -7615.08211624 hartree
twoeener: 3312.69917941 hartree
cpcmener: -0.02334703 hartree
kineticenergy: 1503.90472574 hartree
xcener: -135.228615596687 hartree
chargesum: -0.0000000
charge: 0.477832 -0.217861 -0.324754 -0.330169 -0.264626 -0.143318 -0.179787 -0.414050 -0.450666 -0.086289 -0.133743 -0.097141 0.044724 -0.258735 -0.290168 0.354108 -0.201719 -0.251772 0.211729 -0.176361 0.197943 0.061959 -0.273448 0.276381 -0.179135 -0.245843 -0.149393 -0.123534 -0.183465 0.078119 0.091388 0.081144 0.089774 0.099574 0.101134 0.100288 0.109901 0.105665 0.108053 0.081463 0.098980 0.137223 0.137568 0.136683 0.131738 0.144369 0.142905 0.149491 0.093464 0.092821 0.088687 0.087294 0.087151 0.154804 0.146604 0.159372 0.157813 0.157831
qa: 0.4778 -0.2179 -0.3248 -0.3302 -0.2646 -0.1433 -0.1798 -0.4141 -0.4507 -0.0863 -0.1337 -0.0971 0.0447 -0.2587 -0.2902 0.3541 -0.2017 -0.2518 0.2117 -0.1764 0.1979 0.0620 -0.2734 0.2764 -0.1791 -0.2458 -0.1494 -0.1235 -0.1835 0.0781 0.0914 0.0811 0.0898 0.0996 0.1011 0.1003 0.1099 0.1057 0.1081 0.0815 0.0990 0.1372 0.1376 0.1367 0.1317 0.1444 0.1429 0.1495 0.0935 0.0928 0.0887 0.0873 0.0872 0.1548 0.1466 0.1594 0.1578 0.1578
va: 4.1413 1.0693 2.0824 2.0750 3.8369 3.8808 3.7560 3.8890 3.9086 3.8485 3.8918 3.8146 3.6021 3.8992 4.0261 3.7468 3.8483 3.8710 3.6816 3.8413 4.0621 3.7998 3.9748 3.7066 3.8959 4.0038 3.8948 3.8861 3.9033 1.0161 1.0164 1.0033 1.0082 1.0099 1.0089 1.0093 1.0081 1.0088 1.0051 1.0103 1.0045 0.9909 0.9813 1.0132 1.0158 1.0068 1.0027 0.9974 0.9861 0.9857 1.0058 1.0036 1.0035 0.9978 1.0076 0.9904 0.9892 0.9905
dispcorr: -0.028631165 hartree
energy: -1510.099722118777
dipole: -27.02348 25.83466 -1.18882 18.49987 -17.16091 1.33896 9.38696 -9.82240 -0.43544
magnitude: 1.84275 au
magnitude: 4.68390 debye
