program: Orca
programVersion: 5.0.2
elementType: Si F O O C C C C C C C C C C C C C C C C C C C C C C C C C H H H H H H H H H H H H H H H H H H H H H H H H H H H H H
charge: 0
multiplicity: 1
keywords: wb97x-d3
keywords: def2-TZVPP
keywords: def2/J RIJCOSX
keywords: DEFGRID2
keywords: scfconv7
keywords: smallprint printgap noloewdin
keywords: NOSOSCF
formula: C25H29FO2Si
InChI: InChI=1/C25H29FO2Si/c1-4-27-21-13-15-23(16-14-21)29(2,3)18-8-9-20-12-17-24(26)25(19-20)28-22-10-6-5-7-11-22/h5-7,10-17,19H,4,8-9,18H2,1-3H3
58 atoms
Si -3.804872 1.803251 0.632663
F  1.442675 -5.422123 0.133638
O  1.912407 3.617797 1.439473
O  2.119616 -2.862295 -0.041021
C  -3.721118 0.417275 -0.650511
C  -2.787016 -0.719183 -0.237383
C  -2.044521 2.435477 0.866766
C  -4.449605 1.147561 2.274968
C  -4.928627 3.181094 0.012411
C  -2.475899 -1.690362 -1.377924
C  -1.526655 2.774212 2.121544
C  -1.170262 2.529498 -0.216042
C  -1.4397 -2.710251 -0.995285
C  -0.212323 3.17315 2.288078
C  0.154719 2.923026 -0.075595
C  0.644707 3.243437 1.188465
C  -0.134579 -2.295004 -0.731171
C  -1.751843 -4.05794 -0.864686
C  0.841432 -3.203511 -0.356893
C  -0.784811 -4.978424 -0.480243
C  0.498013 -4.545392 -0.235622
C  2.85058 3.641559 0.37193
C  4.203567 3.978526 0.947415
C  2.735496 -1.812967 -0.670894
C  2.654739 -1.622749 -2.044937
C  3.506763 -0.971101 0.11731
C  3.344336 -0.566687 -2.623141
C  4.20438 0.07105 -0.477418
C  4.120477 0.283493 -1.846418
H  -4.727556 0.032294 -0.848377
H  -3.381793 0.848589 -1.599926
H  -3.219077 -1.274271 0.600615
H  -1.843617 -0.306506 0.132726
H  -4.553471 1.938902 3.02055
H  -5.437063 0.696999 2.149252
H  -3.795792 0.383285 2.699769
H  -5.947494 2.822369 -0.151681
H  -4.984152 4.005074 0.727243
H  -4.57258 3.595409 -0.933386
H  -3.391689 -2.193999 -1.696822
H  -2.12034 -1.116649 -2.239276
H  -2.155246 2.717046 3.003292
H  -1.512284 2.27869 -1.214513
H  0.164705 3.421795 3.273106
H  0.78439 2.966258 -0.954112
H  0.119952 -1.244794 -0.819257
H  -2.75954 -4.401276 -1.062188
H  -1.024851 -6.029162 -0.378499
H  2.555403 4.385893 -0.375596
H  2.883595 2.666894 -0.126632
H  4.521178 3.238967 1.68342
H  4.943711 3.991218 0.146983
H  4.207889 4.961407 1.420029
H  2.064585 -2.28702 -2.663828
H  3.563598 -1.1339 1.186224
H  3.279616 -0.416691 -3.693174
H  4.809449 0.724994 0.137875
H  4.659134 1.102106 -2.305546
elementType: Si F O C H
totalener: -1510.07101094 hartree
nucrepener: 2843.01823789 hartree
electener: -4353.08924883 hartree
oneelecener: -7715.92830811 hartree
twoeener: 3362.83905928 hartree
cpcmener: -0.02403734 hartree
kineticenergy: 1503.90855395 hartree
xcener: -135.228511180224 hartree
chargesum: 0.0000000
charge: 0.486101 -0.218194 -0.327317 -0.327946 -0.280337 -0.143589 -0.166390 -0.444826 -0.417262 -0.049421 -0.091430 -0.157442 0.003569 -0.288837 -0.252844 0.347415 -0.221209 -0.202916 0.216076 -0.160311 0.172146 0.083729 -0.288288 0.285189 -0.192230 -0.235336 -0.139495 -0.147238 -0.179669 0.093235 0.079030 0.093385 0.080153 0.105797 0.110221 0.108588 0.101510 0.100241 0.100268 0.081002 0.089591 0.135720 0.136475 0.133212 0.135795 0.141389 0.138957 0.147099 0.103786 0.062585 0.086824 0.092147 0.094988 0.156230 0.145912 0.159326 0.166920 0.157912
qa: 0.4861 -0.2182 -0.3273 -0.3279 -0.2803 -0.1436 -0.1664 -0.4448 -0.4173 -0.0494 -0.0914 -0.1574 0.0036 -0.2888 -0.2528 0.3474 -0.2212 -0.2029 0.2161 -0.1603 0.1721 0.0837 -0.2883 0.2852 -0.1922 -0.2353 -0.1395 -0.1472 -0.1797 0.0932 0.0790 0.0934 0.0802 0.1058 0.1102 0.1086 0.1015 0.1002 0.1003 0.0810 0.0896 0.1357 0.1365 0.1332 0.1358 0.1414 0.1390 0.1471 0.1038 0.0626 0.0868 0.0921 0.0950 0.1562 0.1459 0.1593 0.1669 0.1579
va: 4.1407 1.0669 2.0817 2.0803 3.8523 3.8506 3.7410 3.9036 3.8895 3.7715 3.8577 3.8734 3.7078 4.0446 3.8822 3.7464 3.9052 3.9047 3.6847 3.8788 4.0532 3.7914 3.9735 3.7066 3.9111 3.9991 3.8920 3.8479 3.8709 1.0157 1.0162 1.0087 1.0007 1.0085 1.0076 1.0049 1.0087 1.0097 1.0088 1.0144 1.0073 0.9895 0.9923 1.0146 1.0137 1.0030 1.0044 0.9989 0.9890 0.9873 1.0037 1.0044 1.0056 0.9960 1.0080 0.9898 0.9809 0.9919
dispcorr: -0.028851037 hartree
energy: -1510.099861976734
dipole: -16.63368 16.20375 -0.42993 30.07240 -29.11968 0.95272 -0.79990 -0.45452 -1.25442
magnitude: 1.63281 au
magnitude: 4.15028 debye
