program: Orca
programVersion: 5.0.2
elementType: Si F O O C C C C C C C C C C C C C C C C C C C C C C C C C H H H H H H H H H H H H H H H H H H H H H H H H H H H H H
charge: 0
multiplicity: 1
keywords: wb97x-d3
keywords: def2-TZVPP
keywords: def2/J RIJCOSX
keywords: DEFGRID2
keywords: scfconv7
keywords: smallprint printgap noloewdin
keywords: NOSOSCF
formula: C25H29FO2Si
InChI: InChI=1/C25H29FO2Si/c1-4-27-21-13-15-23(16-14-21)29(2,3)18-8-9-20-12-17-24(26)25(19-20)28-22-10-6-5-7-11-22/h5-7,10-17,19H,4,8-9,18H2,1-3H3
58 atoms
Si -4.279779 1.466631 0.734465
F  2.246141 -3.705939 -1.006054
O  1.682419 2.398651 0.292499
O  1.892361 -1.410634 0.46818
C  -4.561716 -0.399903 1.022423
C  -3.340243 -1.299887 0.836207
C  -2.434897 1.844695 0.645366
C  -5.041737 2.405224 2.178951
C  -5.092081 2.003575 -0.876783
C  -2.859094 -1.379681 -0.613566
C  -1.61243 1.750722 1.767912
C  -1.806755 2.157469 -0.565941
C  -1.502627 -2.014721 -0.746307
C  -0.235039 1.933716 1.702836
C  -0.439979 2.344313 -0.657854
C  0.36262 2.22298 0.477729
C  -0.400214 -1.412539 -0.139245
C  -1.304296 -3.190556 -1.459395
C  0.858669 -1.976334 -0.220529
C  -0.041178 -3.763053 -1.561517
C  1.024716 -3.15654 -0.937104
C  2.563721 2.288928 1.402069
C  3.954863 2.610345 0.916558
C  3.028694 -1.04059 -0.200231
C  4.219568 -1.118576 0.509544
C  3.008147 -0.567731 -1.504783
C  5.402326 -0.727376 -0.098735
C  4.202828 -0.189103 -2.103368
C  5.401913 -0.26748 -1.409265
H  -4.940755 -0.523894 2.042153
H  -5.375724 -0.735865 0.369617
H  -3.561449 -2.313062 1.185995
H  -2.527019 -0.938151 1.470629
H  -6.104397 2.171946 2.281702
H  -4.564259 2.144319 3.126351
H  -4.955185 3.486771 2.056527
H  -4.723114 1.438614 -1.735655
H  -6.171721 1.84117 -0.830597
H  -4.935369 3.064013 -1.085292
H  -3.588052 -1.932592 -1.211153
H  -2.815766 -0.374868 -1.044315
H  -2.040234 1.518824 2.737708
H  -2.392228 2.251268 -1.473622
H  0.35024 1.836766 2.607566
H  0.019072 2.578733 -1.610997
H  -0.517953 -0.493575 0.423084
H  -2.142503 -3.676768 -1.942857
H  0.109565 -4.683253 -2.111698
H  2.521165 1.277268 1.819788
H  2.268228 2.986375 2.19334
H  4.028574 3.643836 0.575455
H  4.665465 2.476635 1.73234
H  4.257982 1.954628 0.099968
H  4.216457 -1.487159 1.52783
H  2.078841 -0.491558 -2.056078
H  6.330054 -0.791431 0.455247
H  4.189151 0.173807 -3.123029
H  6.327665 0.029495 -1.884206
elementType: Si F O C H
totalener: -1510.06869756 hartree
nucrepener: 2981.25425631 hartree
electener: -4491.32295388 hartree
oneelecener: -7993.22116182 hartree
twoeener: 3501.89820794 hartree
cpcmener: -0.02192893 hartree
kineticenergy: 1503.90970627 hartree
xcener: -135.232785192169 hartree
chargesum: 0.0000000
charge: 0.491714 -0.218536 -0.320466 -0.326286 -0.297199 -0.107783 -0.106771 -0.452086 -0.432698 -0.109186 -0.189383 -0.116056 0.017561 -0.205565 -0.296438 0.327541 -0.179198 -0.149768 0.079039 -0.183689 0.287516 0.025777 -0.277300 0.279321 -0.254972 -0.167216 -0.129734 -0.147678 -0.168197 0.100122 0.085609 0.090656 0.080904 0.102703 0.100329 0.100607 0.101828 0.108968 0.108240 0.094330 0.089627 0.135781 0.144694 0.133754 0.129905 0.094474 0.137472 0.146314 0.100902 0.120123 0.099290 0.096235 0.066300 0.143040 0.149732 0.153469 0.157192 0.155135
qa: 0.4917 -0.2185 -0.3205 -0.3263 -0.2972 -0.1078 -0.1068 -0.4521 -0.4327 -0.1092 -0.1894 -0.1161 0.0176 -0.2056 -0.2964 0.3275 -0.1792 -0.1498 0.0790 -0.1837 0.2875 0.0258 -0.2773 0.2793 -0.2550 -0.1672 -0.1297 -0.1477 -0.1682 0.1001 0.0856 0.0907 0.0809 0.1027 0.1003 0.1006 0.1018 0.1090 0.1082 0.0943 0.0896 0.1358 0.1447 0.1338 0.1299 0.0945 0.1375 0.1463 0.1009 0.1201 0.0993 0.0962 0.0663 0.1430 0.1497 0.1535 0.1572 0.1551
va: 4.0639 1.0650 2.0531 2.0360 3.8668 3.8403 3.6788 3.8996 3.8989 3.7591 3.9099 3.8297 3.6435 3.8528 4.0295 3.7148 3.8700 3.8844 3.8647 3.9348 3.9345 3.7801 3.9654 3.5522 3.9675 3.8737 3.8702 3.8933 3.8628 1.0061 1.0088 1.0082 1.0076 1.0090 1.0111 1.0115 1.0095 1.0102 1.0079 1.0149 1.0177 0.9946 0.9882 1.0134 1.0158 1.0205 1.0044 1.0001 0.9825 0.9918 1.0087 1.0051 1.0066 1.0101 1.0029 0.9914 0.9908 0.9914
dispcorr: -0.034834219 hartree
energy: -1510.103531783662
dipole: -20.52991 20.00760 -0.52231 19.30534 -19.11006 0.19528 7.04490 -6.82284 0.22206
magnitude: 0.60021 au
magnitude: 1.52561 debye
