program: Orca
programVersion: 5.0.2
elementType: Si F O O C C C C C C C C C C C C C C C C C C C C C C C C C H H H H H H H H H H H H H H H H H H H H H H H H H H H H H
charge: 0
multiplicity: 1
keywords: wb97x-d3
keywords: def2-TZVPP
keywords: def2/J RIJCOSX
keywords: DEFGRID2
keywords: scfconv7
keywords: smallprint printgap noloewdin
keywords: NOSOSCF
formula: C25H29FO2Si
InChI: InChI=1/C25H29FO2Si/c1-4-27-21-13-15-23(16-14-21)29(2,3)18-8-9-20-12-17-24(26)25(19-20)28-22-10-6-5-7-11-22/h5-7,10-17,19H,4,8-9,18H2,1-3H3
58 atoms
Si -3.606766 0.156383 1.42262
F  3.154035 -0.813954 -0.772416
O  0.754501 3.999133 3.109649
O  1.501306 -2.934549 -1.346567
C  -3.079633 -0.505358 -0.265062
C  -2.949022 0.576035 -1.33863
C  -2.285017 1.382674 1.967945
C  -3.684843 -1.265731 2.655171
C  -5.275585 1.021026 1.330233
C  -2.093066 0.158403 -2.541855
C  -0.925064 1.103431 1.774805
C  -2.593087 2.599028 2.571712
C  -0.66755 -0.10387 -2.144146
C  0.065877 1.985444 2.160949
C  -1.61426 3.502042 2.974881
C  -0.271561 3.198229 2.767376
C  -0.184769 -1.402936 -2.016125
C  0.181073 0.95197 -1.819501
C  1.098871 -1.647283 -1.553761
C  1.471866 0.723532 -1.366198
C  1.915803 -0.574552 -1.227259
C  0.482184 5.239009 3.748697
C  1.799117 5.923757 4.017056
C  2.54973 -3.452272 -2.053729
C  3.052161 -2.87737 -3.213037
C  3.085268 -4.636538 -1.561208
C  4.110781 -3.494054 -3.868085
C  4.136612 -5.24143 -2.230256
C  4.660088 -4.671761 -3.384097
H  -2.121296 -1.015566 -0.115606
H  -3.771441 -1.286096 -0.598481
H  -2.517606 1.489694 -0.91638
H  -3.943161 0.856136 -1.696996
H  -4.417979 -2.019575 2.358599
H  -2.718897 -1.768427 2.743529
H  -3.960023 -0.916575 3.652797
H  -6.038273 0.339284 0.94608
H  -5.617045 1.359522 2.310668
H  -5.25753 1.890782 0.67037
H  -2.520163 -0.733494 -3.006889
H  -2.1256 0.952309 -3.292721
H  -0.618977 0.173214 1.307473
H  -3.628372 2.87279 2.742577
H  1.109313 1.743858 1.995357
H  -1.918697 4.429953 3.440267
H  -0.818662 -2.247661 -2.259774
H  -0.168454 1.973131 -1.911238
H  2.126194 1.546683 -1.108659
H  -0.05917 5.071018 4.685912
H  -0.148977 5.865304 3.109103
H  1.616365 6.879911 4.50757
H  2.434682 5.328863 4.67388
H  2.343529 6.122216 3.093141
H  2.63035 -1.9665 -3.619234
H  2.677705 -5.077309 -0.659784
H  4.50479 -3.04174 -4.769133
H  4.551814 -6.162258 -1.8411
H  5.486541 -5.142148 -3.900089
elementType: Si F O C H
totalener: -1510.07166432 hartree
nucrepener: 2802.35962131 hartree
electener: -4312.43128563 hartree
oneelecener: -7635.32131397 hartree
twoeener: 3322.89002834 hartree
cpcmener: -0.02324132 hartree
kineticenergy: 1503.90997114 hartree
xcener: -135.228880078115 hartree
chargesum: -0.0000000
charge: 0.476740 -0.217300 -0.325183 -0.324517 -0.268259 -0.146203 -0.188802 -0.413767 -0.449715 -0.083841 -0.093354 -0.128331 0.040860 -0.291089 -0.260005 0.355888 -0.234397 -0.205957 0.178058 -0.204256 0.268812 0.063937 -0.272676 0.303265 -0.188609 -0.257037 -0.158310 -0.117072 -0.191977 0.080412 0.093688 0.080354 0.089993 0.100850 0.100690 0.100378 0.109806 0.105226 0.108011 0.082372 0.098056 0.137777 0.138113 0.132281 0.136345 0.134666 0.143745 0.149897 0.092745 0.091049 0.088647 0.087253 0.086831 0.150410 0.143247 0.157733 0.156040 0.156485
qa: 0.4767 -0.2173 -0.3252 -0.3245 -0.2683 -0.1462 -0.1888 -0.4138 -0.4497 -0.0838 -0.0934 -0.1283 0.0409 -0.2911 -0.2600 0.3559 -0.2344 -0.2060 0.1781 -0.2043 0.2688 0.0639 -0.2727 0.3033 -0.1886 -0.2570 -0.1583 -0.1171 -0.1920 0.0804 0.0937 0.0804 0.0900 0.1008 0.1007 0.1004 0.1098 0.1052 0.1080 0.0824 0.0981 0.1378 0.1381 0.1323 0.1363 0.1347 0.1437 0.1499 0.0927 0.0910 0.0886 0.0873 0.0868 0.1504 0.1432 0.1577 0.1560 0.1565
va: 4.1383 1.0691 2.0827 2.0735 3.8409 3.8909 3.7576 3.8903 3.9109 3.8400 3.8093 3.8809 3.5901 4.0290 3.9017 3.7498 3.9483 3.8587 3.7191 3.8772 3.9623 3.8005 3.9750 3.6803 3.8775 3.9938 3.9113 3.8937 3.9053 1.0151 1.0154 1.0028 1.0084 1.0089 1.0090 1.0096 1.0083 1.0089 1.0054 1.0095 1.0056 0.9803 0.9903 1.0155 1.0134 1.0163 1.0026 0.9988 0.9865 0.9860 1.0058 1.0035 1.0036 1.0047 1.0102 0.9911 0.9895 0.9910
dispcorr: -0.028958108 hartree
energy: -1510.100622427038
dipole: -24.63963 23.60893 -1.03070 16.84200 -15.57401 1.26799 11.73845 -11.98904 -0.25060
magnitude: 1.65316 au
magnitude: 4.20201 debye
