program: Orca
programVersion: 5.0.2
elementType: Si F O O C C C C C C C C C C C C C C C C C C C C C C C C C H H H H H H H H H H H H H H H H H H H H H H H H H H H H H
charge: 0
multiplicity: 1
keywords: wb97x-d3
keywords: def2-TZVPP
keywords: def2/J RIJCOSX
keywords: DEFGRID2
keywords: scfconv7
keywords: smallprint printgap noloewdin
keywords: NOSOSCF
formula: C25H29FO2Si
InChI: InChI=1/C25H29FO2Si/c1-4-27-21-13-15-23(16-14-21)29(2,3)18-8-9-20-12-17-24(26)25(19-20)28-22-10-6-5-7-11-22/h5-7,10-17,19H,4,8-9,18H2,1-3H3
58 atoms
Si -3.641096 1.416807 -0.017371
F  1.538713 -3.977744 -1.628897
O  2.134651 2.715845 1.24639
O  1.328879 -1.285801 -1.487839
C  -3.844001 -0.358724 -0.663631
C  -3.985349 -1.462319 0.386077
C  -1.844484 1.837954 0.361817
C  -4.662402 1.649569 1.547096
C  -4.239875 2.588076 -1.366635
C  -2.740514 -1.721021 1.240703
C  -1.32487 1.794714 1.660708
C  -0.953715 2.17916 -0.655595
C  -1.596212 -2.32026 0.47128
C  0.001721 2.076377 1.930691
C  0.383674 2.469002 -0.410805
C  0.869092 2.42814 0.894837
C  -0.630106 -1.515901 -0.127299
C  -1.487448 -3.701431 0.324707
C  0.412839 -2.07312 -0.846853
C  -0.440547 -4.273516 -0.384041
C  0.507122 -3.451271 -0.956237
C  3.010125 3.27193 0.272647
C  4.290142 3.665971 0.965444
C  2.451594 -0.885773 -0.820447
C  2.634625 -1.051111 0.54612
C  3.430306 -0.270681 -1.594163
C  3.810815 -0.597329 1.130786
C  4.598941 0.170286 -0.995488
C  4.798886 0.008137 0.370213
H  -4.749681 -0.355216 -1.281176
H  -3.029734 -0.587812 -1.359576
H  -4.269575 -2.400837 -0.101341
H  -4.811551 -1.217054 1.059243
H  -5.718884 1.443499 1.360932
H  -4.344386 0.990605 2.357895
H  -4.593755 2.674995 1.917062
H  -5.306131 2.451872 -1.561721
H  -4.088026 3.6338 -1.091595
H  -3.719363 2.42094 -2.312411
H  -2.416008 -0.793661 1.719062
H  -3.014212 -2.401036 2.050877
H  -1.967891 1.538578 2.495473
H  -1.294305 2.224288 -1.684564
H  0.373974 2.041111 2.947694
H  1.025261 2.725458 -1.243304
H  -0.680394 -0.437985 -0.033808
H  -2.226369 -4.349715 0.780066
H  -0.35697 -5.348331 -0.483387
H  2.546661 4.148667 -0.192692
H  3.210677 2.543307 -0.518658
H  4.116753 4.431277 1.722882
H  4.771678 2.810892 1.440595
H  4.986384 4.074084 0.232287
H  1.881867 -1.524092 1.163113
H  3.274815 -0.145413 -2.658659
H  3.949048 -0.727264 2.196517
H  5.358396 0.644725 -1.603836
H  5.713703 0.351834 0.834316
elementType: Si F O C H
totalener: -1510.06928760 hartree
nucrepener: 3001.43130427 hartree
electener: -4511.50059186 hartree
oneelecener: -8033.55512435 hartree
twoeener: 3522.05453249 hartree
cpcmener: -0.02266534 hartree
kineticenergy: 1503.91750776 hartree
xcener: -135.235310886889 hartree
chargesum: 0.0000000
charge: 0.489176 -0.216804 -0.322526 -0.324310 -0.277754 -0.152900 -0.100698 -0.433207 -0.465385 -0.113808 -0.121833 -0.140946 -0.011195 -0.273705 -0.252685 0.320196 -0.116711 -0.151485 0.123063 -0.210114 0.278099 0.016010 -0.277169 0.288491 -0.167031 -0.233823 -0.179217 -0.131753 -0.184612 0.098791 0.084336 0.091471 0.085781 0.112376 0.099959 0.114463 0.103681 0.102303 0.100785 0.092428 0.097363 0.144468 0.131942 0.132509 0.136736 0.072574 0.141921 0.147144 0.119762 0.100256 0.095050 0.086473 0.092610 0.148953 0.140191 0.155447 0.155042 0.159821
qa: 0.4892 -0.2168 -0.3225 -0.3243 -0.2778 -0.1529 -0.1007 -0.4332 -0.4654 -0.1138 -0.1218 -0.1409 -0.0112 -0.2737 -0.2527 0.3202 -0.1167 -0.1515 0.1231 -0.2101 0.2781 0.0160 -0.2772 0.2885 -0.1670 -0.2338 -0.1792 -0.1318 -0.1846 0.0988 0.0843 0.0915 0.0858 0.1124 0.1000 0.1145 0.1037 0.1023 0.1008 0.0924 0.0974 0.1445 0.1319 0.1325 0.1367 0.0726 0.1419 0.1471 0.1198 0.1003 0.0950 0.0865 0.0926 0.1490 0.1402 0.1554 0.1550 0.1598
va: 4.0995 1.0731 2.0462 2.0698 3.8224 3.9097 3.6339 3.8972 3.9142 3.7998 3.8349 3.8745 3.6786 4.0438 3.8574 3.7297 3.7530 3.8746 3.7873 3.9279 4.0029 3.7789 3.9621 3.6165 3.8133 3.9427 3.8951 3.8495 3.8291 1.0078 1.0140 1.0032 1.0010 1.0067 1.0078 1.0092 1.0110 1.0112 1.0116 1.0148 1.0106 0.9851 0.9956 1.0141 1.0115 1.0423 0.9999 0.9991 0.9951 0.9811 1.0057 1.0041 1.0052 1.0046 1.0115 0.9926 0.9912 0.9869
dispcorr: -0.035305251 hartree
energy: -1510.104592847953
dipole: -16.12914 15.63300 -0.49613 22.32273 -21.85581 0.46692 8.36116 -7.94818 0.41298
magnitude: 0.79669 au
magnitude: 2.02503 debye
