program: Orca
programVersion: 5.0.2
elementType: Si F O O C C C C C C C C C C C C C C C C C C C C C C C C C H H H H H H H H H H H H H H H H H H H H H H H H H H H H H
charge: 0
multiplicity: 1
keywords: wb97x-d3
keywords: def2-TZVPP
keywords: def2/J RIJCOSX
keywords: DEFGRID2
keywords: scfconv7
keywords: smallprint printgap noloewdin
keywords: NOSOSCF
formula: C25H29FO2Si
InChI: InChI=1/C25H29FO2Si/c1-4-27-21-13-15-23(16-14-21)29(2,3)18-8-9-20-12-17-24(26)25(19-20)28-22-10-6-5-7-11-22/h5-7,10-17,19H,4,8-9,18H2,1-3H3
58 atoms
Si -3.730216 0.067533 1.438134
F  2.949011 -0.484715 -0.633896
O  0.998323 3.610449 2.748925
O  1.50133 -2.755505 -1.137563
C  -3.321241 -0.659982 -0.256149
C  -3.216807 0.387987 -1.367104
C  -2.298846 1.207302 1.886972
C  -3.840351 -1.319923 2.706977
C  -5.336675 1.045796 1.40123
C  -2.319166 -0.032914 -2.539363
C  -0.975943 0.759031 1.772004
C  -2.477865 2.519134 2.318781
C  -0.882511 -0.160886 -2.115314
C  0.102097 1.571557 2.065736
C  -1.409524 3.356948 2.624195
C  -0.106431 2.885148 2.493133
C  -0.300949 -1.407908 -1.903801
C  -0.123478 0.976802 -1.850479
C  0.989578 -1.520138 -1.410812
C  1.17135 0.880056 -1.36282
C  1.709782 -0.367718 -1.132057
C  0.857223 4.959461 3.173308
C  2.238317 5.534111 3.368029
C  2.630257 -3.17937 -1.783768
C  3.070733 -2.638619 -2.984475
C  3.317384 -4.22903 -1.186462
C  4.218097 -3.150972 -3.5763
C  4.456307 -4.732892 -1.793745
C  4.917351 -4.194453 -2.98838
H  -2.369581 -1.190968 -0.136959
H  -4.047403 -1.431607 -0.531305
H  -2.832455 1.335743 -0.974826
H  -4.215642 0.610682 -1.750954
H  -4.639522 -2.025343 2.467437
H  -2.909476 -1.889547 2.756693
H  -4.035957 -0.931942 3.709007
H  -5.59179 1.450385 2.382957
H  -5.298172 1.882236 0.700418
H  -6.167301 0.405634 1.094647
H  -2.673358 -0.979131 -2.955705
H  -2.4018 0.712425 -3.334781
H  -0.769638 -0.252838 1.438233
H  -3.478266 2.923347 2.426169
H  1.114441 1.199508 1.960366
H  -1.61442 4.366249 2.95542
H  -0.859602 -2.313698 -2.109214
H  -0.550128 1.959333 -2.011823
H  1.752558 1.766764 -1.143841
H  0.289425 5.005701 4.108844
H  0.306675 5.537516 2.423312
H  2.81307 5.520118 2.441354
H  2.155887 6.571534 3.692681
H  2.795929 4.990004 4.131149
H  2.533418 -1.832887 -3.468892
H  2.960352 -4.64384 -0.25201
H  4.561999 -2.725004 -4.510142
H  4.990035 -5.548764 -1.323451
H  5.811015 -4.585553 -3.456326
elementType: Si F O C H
totalener: -1510.07101254 hartree
nucrepener: 2844.58502147 hartree
electener: -4354.65603401 hartree
oneelecener: -7719.97684682 hartree
twoeener: 3365.32081281 hartree
cpcmener: -0.02346421 hartree
kineticenergy: 1503.90547357 hartree
xcener: -135.228351427233 hartree
chargesum: -0.0000000
charge: 0.476250 -0.219252 -0.325639 -0.327619 -0.271303 -0.144053 -0.179753 -0.417313 -0.446462 -0.083569 -0.111896 -0.119130 0.044836 -0.307571 -0.262372 0.370315 -0.249308 -0.184289 0.184463 -0.217770 0.275096 0.063168 -0.274255 0.288364 -0.179165 -0.250035 -0.160511 -0.121092 -0.188261 0.079101 0.094898 0.076980 0.091373 0.101417 0.100565 0.100951 0.105807 0.106870 0.109885 0.082881 0.097105 0.139096 0.140100 0.134397 0.136076 0.135598 0.142005 0.148653 0.093250 0.091818 0.087168 0.088563 0.087319 0.151757 0.143411 0.157989 0.156345 0.156749
qa: 0.4762 -0.2193 -0.3256 -0.3276 -0.2713 -0.1441 -0.1798 -0.4173 -0.4465 -0.0836 -0.1119 -0.1191 0.0448 -0.3076 -0.2624 0.3703 -0.2493 -0.1843 0.1845 -0.2178 0.2751 0.0632 -0.2743 0.2884 -0.1792 -0.2500 -0.1605 -0.1211 -0.1883 0.0791 0.0949 0.0770 0.0914 0.1014 0.1006 0.1010 0.1058 0.1069 0.1099 0.0829 0.0971 0.1391 0.1401 0.1344 0.1361 0.1356 0.1420 0.1487 0.0932 0.0918 0.0872 0.0886 0.0873 0.1518 0.1434 0.1580 0.1563 0.1567
va: 4.1350 1.0634 2.0811 2.0681 3.8375 3.8918 3.7464 3.8961 3.9162 3.8410 3.8134 3.8710 3.5941 4.0039 3.9069 3.7481 3.9498 3.8367 3.7148 3.8899 3.9375 3.8004 3.9747 3.6874 3.8731 3.9949 3.9119 3.8962 3.9026 1.0159 1.0148 1.0031 1.0078 1.0093 1.0089 1.0091 1.0085 1.0057 1.0087 1.0090 1.0058 0.9825 0.9896 1.0145 1.0131 1.0165 1.0020 1.0004 0.9856 0.9864 1.0034 1.0059 1.0035 1.0031 1.0100 0.9910 0.9894 0.9908
dispcorr: -0.029887656 hartree
energy: -1510.100900193915
dipole: -23.82690 22.85562 -0.97129 15.09034 -13.83538 1.25497 9.84869 -10.26800 -0.41931
magnitude: 1.64139 au
magnitude: 4.17208 debye
