program: Orca
programVersion: 5.0.2
elementType: Si F O O C C C C C C C C C C C C C C C C C C C C C C C C C H H H H H H H H H H H H H H H H H H H H H H H H H H H H H
charge: 0
multiplicity: 1
keywords: wb97x-d3
keywords: def2-TZVPP
keywords: def2/J RIJCOSX
keywords: DEFGRID2
keywords: scfconv7
keywords: smallprint printgap noloewdin
keywords: NOSOSCF
formula: C25H29FO2Si
InChI: InChI=1/C25H29FO2Si/c1-4-27-21-13-15-23(16-14-21)29(2,3)18-8-9-20-12-17-24(26)25(19-20)28-22-10-6-5-7-11-22/h5-7,10-17,19H,4,8-9,18H2,1-3H3
58 atoms
Si -3.872201 1.654013 1.047846
F  2.124711 -4.448158 -0.566022
O  1.636533 3.384189 -0.736886
O  1.913338 -1.965667 -1.66449
C  -4.116079 0.106583 -0.021137
C  -2.980347 -0.899088 0.154592
C  -2.158145 2.314347 0.629517
C  -3.952273 1.202781 2.872905
C  -5.179523 2.940115 0.63067
C  -2.911051 -1.980187 -0.929389
C  -1.015683 1.800938 1.244179
C  -1.949954 3.221055 -0.415629
C  -1.589828 -2.695148 -0.879056
C  0.269296 2.132419 0.833081
C  -0.680811 3.575093 -0.837723
C  0.445176 3.018069 -0.22803
C  -0.44089 -2.02664 -1.303475
C  -1.453572 -3.972284 -0.348344
C  0.804259 -2.614836 -1.200489
C  -0.206369 -4.578033 -0.242304
C  0.909614 -3.892795 -0.667056
C  2.830419 2.754056 -0.284852
C  3.383587 3.376089 0.979063
C  2.78611 -1.410283 -0.77161
C  3.996804 -0.972399 -1.297781
C  2.507968 -1.255394 0.580581
C  4.93689 -0.393138 -0.461489
C  3.464533 -0.675509 1.40594
C  4.680791 -0.246601 0.896646
H  -5.086709 -0.357996 0.182486
H  -4.154189 0.43648 -1.066279
H  -3.045613 -1.378232 1.13623
H  -2.025046 -0.368344 0.1471
H  -3.207852 0.454075 3.151339
H  -3.791023 2.074705 3.510403
H  -4.931222 0.789754 3.127593
H  -5.19119 3.183397 -0.433844
H  -6.178044 2.577681 0.885715
H  -5.022012 3.871812 1.177973
H  -3.734859 -2.68898 -0.818951
H  -3.030674 -1.50695 -1.908234
H  -1.109698 1.10254 2.068609
H  -2.796721 3.659732 -0.93251
H  1.110542 1.68558 1.345818
H  -0.551085 4.27304 -1.656434
H  -0.510895 -1.028054 -1.720708
H  -2.329559 -4.510622 -0.008181
H  -0.104567 -5.574126 0.169347
H  3.542691 2.883238 -1.100546
H  2.674757 1.677614 -0.166283
H  2.728741 3.242678 1.840409
H  4.341631 2.912636 1.218179
H  3.557643 4.444649 0.845769
H  4.198415 -1.093069 -2.355032
H  1.563115 -1.57452 1.001934
H  5.879699 -0.060167 -0.876249
H  3.246765 -0.561193 2.460215
H  5.420825 0.198796 1.548247
elementType: Si F O C H
totalener: -1510.06796368 hartree
nucrepener: 2918.31387192 hartree
electener: -4428.38183560 hartree
oneelecener: -7866.57673418 hartree
twoeener: 3438.19489858 hartree
cpcmener: -0.02228136 hartree
kineticenergy: 1503.91175619 hartree
xcener: -135.231265027649 hartree
chargesum: 0.0000000
charge: 0.497461 -0.217170 -0.339607 -0.328891 -0.253121 -0.105723 -0.162705 -0.422254 -0.453604 -0.078408 -0.169599 -0.092130 0.016329 -0.260819 -0.296788 0.364015 -0.221376 -0.177317 0.152873 -0.176619 0.246580 0.116552 -0.272861 0.336083 -0.255642 -0.210376 -0.099276 -0.136765 -0.234902 0.083339 0.075031 0.090720 0.052327 0.100246 0.107590 0.105718 0.099351 0.104395 0.106355 0.083656 0.088159 0.144680 0.135825 0.132627 0.132221 0.138427 0.142454 0.148283 0.113837 0.006720 0.093343 0.092037 0.096821 0.143095 0.147977 0.155326 0.157228 0.158273
qa: 0.4975 -0.2172 -0.3396 -0.3289 -0.2531 -0.1057 -0.1627 -0.4223 -0.4536 -0.0784 -0.1696 -0.0921 0.0163 -0.2608 -0.2968 0.3640 -0.2214 -0.1773 0.1529 -0.1766 0.2466 0.1166 -0.2729 0.3361 -0.2556 -0.2104 -0.0993 -0.1368 -0.2349 0.0833 0.0750 0.0907 0.0523 0.1002 0.1076 0.1057 0.0994 0.1044 0.1064 0.0837 0.0882 0.1447 0.1358 0.1326 0.1322 0.1384 0.1425 0.1483 0.1138 0.0067 0.0933 0.0920 0.0968 0.1431 0.1480 0.1553 0.1572 0.1583
va: 4.1450 1.0695 2.0895 2.0791 3.8425 3.8714 3.7202 3.8872 3.9232 3.8191 3.9001 3.8838 3.6771 3.8940 4.0601 3.7239 3.9617 3.9017 3.7355 3.9059 4.0087 3.8460 3.9061 3.6204 3.9891 3.8309 3.8414 3.8224 3.8759 1.0155 1.0164 1.0076 1.0125 1.0104 1.0080 1.0082 1.0113 1.0106 1.0094 1.0128 1.0081 0.9915 0.9893 1.0096 1.0154 1.0105 1.0024 0.9989 0.9956 1.0320 0.9994 1.0102 1.0093 1.0100 1.0065 0.9897 0.9919 0.9910
dispcorr: -0.032271599 hartree
energy: -1510.100235283099
dipole: -18.97766 18.44071 -0.53694 22.32894 -22.45897 -0.13003 12.59335 -11.74642 0.84694
magnitude: 1.01120 au
magnitude: 2.57026 debye
