program: Orca
programVersion: 5.0.2
elementType: Si F O O C C C C C C C C C C C C C C C C C C C C C C C C C H H H H H H H H H H H H H H H H H H H H H H H H H H H H H
charge: 0
multiplicity: 1
keywords: wb97x-d3
keywords: def2-TZVPP
keywords: def2/J RIJCOSX
keywords: DEFGRID2
keywords: scfconv7
keywords: smallprint printgap noloewdin
keywords: NOSOSCF
formula: C25H29FO2Si
InChI: InChI=1/C25H29FO2Si/c1-4-27-21-13-15-23(16-14-21)29(2,3)18-8-9-20-12-17-24(26)25(19-20)28-22-10-6-5-7-11-22/h5-7,10-17,19H,4,8-9,18H2,1-3H3
58 atoms
Si -3.827815 1.112743 0.943092
F  1.780287 -3.983492 -0.147043
O  1.784884 3.000953 -0.273937
O  1.439104 -1.439536 0.772487
C  -3.836798 -0.783396 0.810339
C  -4.020436 -1.375824 -0.588166
C  -2.105674 1.805389 0.623617
C  -4.343494 1.571305 2.695608
C  -5.03797 1.846585 -0.29803
C  -2.863145 -1.141118 -1.565973
C  -1.092618 1.677653 1.5738
C  -1.748051 2.380531 -0.600978
C  -1.611668 -1.890765 -1.201011
C  0.219187 2.066013 1.32488
C  -0.451661 2.775095 -0.873755
C  0.549989 2.609357 0.084903
C  -0.615114 -1.299619 -0.428008
C  -1.431174 -3.208533 -1.613954
C  0.515825 -2.007046 -0.059712
C  -0.292157 -3.923476 -1.26942
C  0.670495 -3.315636 -0.492783
C  2.868012 2.79512 0.624493
C  4.13679 3.227641 -0.06726
C  2.671221 -1.111413 0.280525
C  3.681869 -0.939961 1.219391
C  2.92064 -0.915104 -1.071073
C  4.950483 -0.57518 0.797676
C  4.199192 -0.554149 -1.477123
C  5.218741 -0.384216 -0.552223
H  -2.933564 -1.183103 1.284772
H  -4.663469 -1.131521 1.440325
H  -4.929829 -0.966524 -1.037074
H  -4.189971 -2.45484 -0.510602
H  -5.357575 1.226706 2.910863
H  -3.687942 1.123562 3.446142
H  -4.325472 2.652012 2.851348
H  -4.772024 1.617422 -1.331952
H  -6.046067 1.459364 -0.132449
H  -5.092416 2.933859 -0.209086
H  -3.186107 -1.457527 -2.560706
H  -2.645839 -0.072997 -1.642352
H  -1.309824 1.243612 2.54413
H  -2.493363 2.517536 -1.376656
H  0.962354 1.931355 2.09958
H  -0.201073 3.20988 -1.834148
H  -0.715855 -0.273728 -0.097412
H  -2.187066 -3.689386 -2.222965
H  -0.153846 -4.944888 -1.600542
H  2.930293 1.739446 0.906761
H  2.715098 3.375335 1.54106
H  4.114907 4.288035 -0.322126
H  4.985211 3.062603 0.597015
H  4.310921 2.654948 -0.978567
H  3.471045 -1.091355 2.270883
H  2.137129 -1.033334 -1.809047
H  5.735389 -0.444365 1.5316
H  4.392814 -0.404467 -2.531623
H  6.211567 -0.104004 -0.878399
elementType: Si F O C H
totalener: -1510.06979193 hartree
nucrepener: 2994.12440869 hartree
electener: -4504.19420062 hartree
oneelecener: -8018.81221294 hartree
twoeener: 3514.61801232 hartree
cpcmener: -0.02171287 hartree
kineticenergy: 1503.91147577 hartree
xcener: -135.233849421437 hartree
chargesum: -0.0000000
charge: 0.491051 -0.217817 -0.326490 -0.319998 -0.275462 -0.156365 -0.115781 -0.460594 -0.437491 -0.110551 -0.144967 -0.118724 -0.008731 -0.266195 -0.271732 0.346064 -0.116476 -0.144995 0.097958 -0.209926 0.301977 0.063962 -0.294819 0.251407 -0.222713 -0.144623 -0.119772 -0.163869 -0.195915 0.083526 0.098481 0.085056 0.092276 0.102553 0.101006 0.101521 0.100286 0.112131 0.115080 0.097251 0.090354 0.131141 0.143853 0.136235 0.132311 0.060084 0.142189 0.146221 0.064951 0.113726 0.101238 0.094622 0.086665 0.140421 0.150423 0.154760 0.157020 0.156205
qa: 0.4911 -0.2178 -0.3265 -0.3200 -0.2755 -0.1564 -0.1158 -0.4606 -0.4375 -0.1106 -0.1450 -0.1187 -0.0087 -0.2662 -0.2717 0.3461 -0.1165 -0.1450 0.0980 -0.2099 0.3020 0.0640 -0.2948 0.2514 -0.2227 -0.1446 -0.1198 -0.1639 -0.1959 0.0835 0.0985 0.0851 0.0923 0.1026 0.1010 0.1015 0.1003 0.1121 0.1151 0.0973 0.0904 0.1311 0.1439 0.1362 0.1323 0.0601 0.1422 0.1462 0.0650 0.1137 0.1012 0.0946 0.0867 0.1404 0.1504 0.1548 0.1570 0.1562
va: 4.1017 1.0695 2.0671 2.0548 3.8247 3.9121 3.6443 3.9086 3.9032 3.7994 3.8684 3.8371 3.6721 3.8458 4.0465 3.7235 3.7654 3.8707 3.8226 3.9552 3.9642 3.7736 3.9691 3.6318 3.9207 3.8216 3.8593 3.8868 3.8605 1.0134 1.0075 1.0008 1.0026 1.0107 1.0118 1.0111 1.0072 1.0069 1.0089 1.0102 1.0160 0.9974 0.9866 1.0122 1.0146 1.0400 0.9994 1.0001 0.9887 0.9949 1.0073 1.0044 1.0033 1.0114 1.0035 0.9903 0.9912 0.9917
dispcorr: -0.034971083 hartree
energy: -1510.104763016597
dipole: -17.17845 16.84646 -0.33199 19.20317 -19.07032 0.13284 1.74578 -1.98006 -0.23428
magnitude: 0.42749 au
magnitude: 1.08660 debye
