program: Orca
programVersion: 5.0.2
elementType: Si F O O C C C C C C C C C C C C C C C C C C C C C C C C C H H H H H H H H H H H H H H H H H H H H H H H H H H H H H
charge: 0
multiplicity: 1
keywords: wb97x-d3
keywords: def2-TZVPP
keywords: def2/J RIJCOSX
keywords: DEFGRID2
keywords: scfconv7
keywords: smallprint printgap noloewdin
keywords: NOSOSCF
formula: C25H29FO2Si
InChI: InChI=1/C25H29FO2Si/c1-4-27-21-13-15-23(16-14-21)29(2,3)18-8-9-20-12-17-24(26)25(19-20)28-22-10-6-5-7-11-22/h5-7,10-17,19H,4,8-9,18H2,1-3H3
58 atoms
Si -2.34483 1.919506 -0.672457
F  2.913468 -2.421578 0.70234
O  1.026322 1.721437 4.351455
O  2.156568 -2.386667 -1.855433
C  -2.423827 0.135341 -1.279524
C  -3.049633 -0.847358 -0.287254
C  -1.313074 1.912508 0.904675
C  -4.057464 2.603268 -0.301748
C  -1.494075 2.965403 -1.988269
C  -2.577995 -2.298112 -0.470374
C  -0.131565 1.163038 0.98538
C  -1.683214 2.618224 2.047376
C  -1.113832 -2.432712 -0.161421
C  0.631308 1.118438 2.136449
C  -0.933555 2.589719 3.219184
C  0.23278 1.831304 3.269953
C  -0.167302 -2.410443 -1.180717
C  -0.671178 -2.484463 1.158319
C  1.191164 -2.395509 -0.894882
C  0.682594 -2.498138 1.456793
C  1.600433 -2.435783 0.429324
C  0.669755 2.406062 5.544778
C  1.702663 2.080553 6.594994
C  1.997487 -1.599905 -2.96566
C  2.43368 -2.121719 -4.174924
C  1.472785 -0.314836 -2.895263
C  2.342672 -1.348915 -5.324052
C  1.376915 0.441245 -4.054413
C  1.807609 -0.069279 -5.271838
H  -2.94271 0.083417 -2.242173
H  -1.388173 -0.148587 -1.499115
H  -4.138045 -0.815604 -0.381603
H  -2.833576 -0.552503 0.745124
H  -4.023525 3.645759 0.021921
H  -4.686394 2.567918 -1.194464
H  -4.568547 2.033859 0.477135
H  -1.402571 4.009444 -1.681196
H  -0.484953 2.598427 -2.192232
H  -2.042774 2.948942 -2.932904
H  -3.157263 -2.947966 0.190292
H  -2.779103 -2.624522 -1.493851
H  0.208429 0.583781 0.132607
H  -2.590234 3.212494 2.047787
H  1.538571 0.526708 2.171467
H  -1.276731 3.156793 4.074203
H  -0.494374 -2.390208 -2.213851
H  -1.389831 -2.505802 1.968407
H  1.026437 -2.53483 2.482686
H  -0.324668 2.092376 5.880164
H  0.63317 3.486162 5.366331
H  2.699102 2.405511 6.293932
H  1.450489 2.595883 7.521996
H  1.735305 1.011243 6.806946
H  2.84279 -3.12359 -4.214123
H  1.145836 0.1008 -1.950138
H  2.683211 -1.758206 -6.266482
H  0.966641 1.441695 -3.999625
H  1.729782 0.52707 -6.171312
elementType: Si F O C H
totalener: -1510.06937869 hartree
nucrepener: 2921.21866660 hartree
electener: -4431.28804528 hartree
oneelecener: -7872.61184481 hartree
twoeener: 3441.32379952 hartree
cpcmener: -0.02438522 hartree
kineticenergy: 1503.90797351 hartree
xcener: -135.231562609422 hartree
chargesum: 0.0000000
charge: 0.443352 -0.220060 -0.323950 -0.332313 -0.209193 -0.155019 -0.247994 -0.447739 -0.404479 -0.084020 0.018642 -0.080523 0.076408 -0.341187 -0.289692 0.384899 -0.246366 -0.217515 0.220894 -0.214481 0.221700 0.062067 -0.273288 0.228689 -0.222005 -0.162950 -0.136762 -0.183232 -0.163499 0.095995 0.025261 0.089929 0.081894 0.103768 0.108917 0.107969 0.104916 0.089310 0.103117 0.094094 0.083622 0.090464 0.139002 0.132347 0.136840 0.150544 0.139247 0.147828 0.091508 0.093442 0.087160 0.088712 0.087050 0.145914 0.208460 0.156845 0.158135 0.157329
qa: 0.4434 -0.2201 -0.3240 -0.3323 -0.2092 -0.1550 -0.2480 -0.4477 -0.4045 -0.0840 0.0186 -0.0805 0.0764 -0.3412 -0.2897 0.3849 -0.2464 -0.2175 0.2209 -0.2145 0.2217 0.0621 -0.2733 0.2287 -0.2220 -0.1630 -0.1368 -0.1832 -0.1635 0.0960 0.0253 0.0899 0.0819 0.1038 0.1089 0.1080 0.1049 0.0893 0.1031 0.0941 0.0836 0.0905 0.1390 0.1323 0.1368 0.1505 0.1392 0.1478 0.0915 0.0934 0.0872 0.0887 0.0870 0.1459 0.2085 0.1568 0.1581 0.1573
va: 4.1518 1.0640 2.0848 2.0859 3.8230 3.9105 3.7689 3.9236 3.8912 3.8483 3.6861 3.8209 3.5758 4.0452 3.9252 3.7350 3.8978 3.8489 3.6709 3.8587 4.0088 3.8015 3.9750 3.7862 3.9778 3.8629 3.9004 3.9228 3.9067 1.0178 1.0302 1.0086 1.0016 1.0093 1.0092 1.0061 1.0116 1.0127 1.0083 1.0066 1.0094 0.9772 0.9885 1.0149 1.0131 1.0017 1.0040 0.9995 0.9861 0.9857 1.0034 1.0058 1.0035 1.0071 0.9226 0.9892 0.9937 0.9915
dispcorr: -0.032624831 hartree
energy: -1510.102003518306
dipole: -23.07342 21.36461 -1.70880 20.51662 -19.71741 0.79922 6.68541 -6.37806 0.30735
magnitude: 1.91134 au
magnitude: 4.85824 debye
