program: Gaussian 09
title: 000067889
version: EM64L-G09RevD.01
frameworkgroup: C1[X(C5H5F3O2)]
method: RPBEPBE
basis: SDD
operation: Freq
keyword: #pfreq=noraman
keyword: PBEPBE/SDD
title: #p freq=noraman PBEPBE/SDD
converged: NO YES NO NO
title: Mulliken charges:
elementType: F F F O O C C C C C H H H H H
charge: -0.151600 -0.165125 -0.151611 -0.273649 -0.236556 -0.309522 0.392659 0.272330 -0.201354 -0.460074 0.269033 0.269045 0.261036 0.236207 0.249181
chargesum: 0.00000
title: Mulliken charges with hydrogens summed into heavy atoms:
elementType: F F F O O C C C C C
charge: -0.151600 -0.165125 -0.151611 -0.273649 -0.236556 0.228556 0.392659 0.272330 0.059681 0.025314
polarizability: 9.41376854e+01 4.79480161e+00 5.78674246e+01 1.39477089e-02 -2.78729345e-03 3.76615425e+01
1716.lowfreq: -9.8242 -0.0005 0.0003 0.0006 3.6492 4.7726 16.2872 50.6284 96.3477
frequency: 14.0125 50.6215 96.3459 111.8638 201.6779 202.7064 257.1584 315.4979 319.6530 439.9964 464.1597 503.2571 527.5480 559.0774 654.0011 773.9528 776.6942 852.1361 889.6508 984.3888 1001.6418 1004.9407 1027.3062 1067.1343 1092.4867 1119.4304 1229.2650 1237.6392 1290.9313 1376.1022 1414.9471 1447.5403 1636.6922 1641.0812 3036.9686 3103.8536 3109.0499 3167.9542 3225.8855
redmass: 6.7839 8.0308 6.5203 3.0359 7.2934 3.2306 7.5156 6.0208 3.4330 8.9139 7.1347 1.7770 6.5028 9.5517 4.6618 5.3364 3.3754 5.1617 2.5638 6.4778 1.3016 1.1425 9.3928 1.6774 2.1943 4.4215 3.9220 1.3037 1.4411 1.6432 1.2256 1.0706 11.9759 4.4178 1.0574 1.1068 1.0605 1.0960 1.1158
irintensity: 2.9965 1.0874 3.3566 3.6749 1.1730 6.1080 2.6791 10.2315 2.4289 4.1934 1.7199 0.0023 5.1339 24.9068 6.6822 13.6590 23.4430 56.2583 93.9858 13.8460 0.4847 82.2881 251.1168 64.1564 102.1668 406.0194 124.9191 66.8940 18.3102 14.5459 88.0400 9.0066 143.9153 25.2419 12.0044 4.0089 2.7078 1.8417 5.4052
temp: 298.150 k
press: 1.00000 atm
elementType: 9 9 9 8 8 6 6 6 6 6 1 1 1 1 1
symmnumber: 1
zpe: 252563.1 jmol-1
zpe.correction: 0.096196 hartree
zpe.thermalcorrener: 0.106467 hartree
zpe.thermalcorrenthalpy: 0.107411 hartree
zpe.thermalcorrgfe: 0.058072 hartree
zpe.sumelectzpe: -642.715034 hartree
zpe.sumelectthermal: -642.704764 hartree
zpe.sumelectthermalent: -642.703820 hartree
zpe.sumelectthermalfe: -642.753158 hartree
dipole: -2.8293 -0.2653 0.0007
dipole: 2.8417
quadrupole: -52.5495 -58.2591 -57.4239
quadrupole: 8.1103 0.0024 0.0015
quadrupole: 3.5280 -2.1816 -1.3464 8.1103 0.0024 0.0015
hfenergy: -642.8112305 hartree
pointgroup: C01 [X(C5H5F3O2)]
dipole: -1.1121239 0.1146676 -0.0002703 debye
dipolederiv: -0.4127526 -0.0826734 0.0803112 -0.0752123 -0.4749403 0.2678366 0.0307857 0.2300916 -0.6523412 -0.7856617 0.2958864 -0.0003656 0.1960497 -0.5424729 0.000309 -0.0003355 0.0003445 -0.3021446 -0.4126975 -0.0827158 -0.0799176 -0.0751129 -0.4760046 -0.2682197 -0.0304539 -0.2304962 -0.6512869 -1.6191437 -0.0941089 0.0003749 -0.1596014 -0.451443 0.0002755 0.0001324 0.0001747 -0.2766298 -0.6676376 0.0363373 0.000013 -0.116554 -0.9105252 0.0003732 0.0003388 0.0008762 -0.315976 0.4675522 -0.1695651 0.0001345 -0.3427696 0.1204352 0.0000979 0.0003964 0.0000955 0.2089683 1.686649 -0.0656459 -0.0000729 0.033762 1.4745165 0.0000444 -0.0000632 0.000061 1.5831465 1.9704847 -0.0042415 -0.0004126 0.1146265 1.1143734 -0.0005847 -0.0007689 -0.0009285 0.2895808 -0.5459917 0.2400987 -0.0001174 0.1426915 0.0009654 -0.0002316 0.0001476 -0.0003416 -0.1716169 0.1218666 -0.0859277 -0.0001813 0.085903 0.0696378 -0.0003213 -0.0001892 -0.0003081 -0.2677363 -0.0024311 0.0006225 -0.018374 0.0824391 0.0572156 -0.0571384 0.0210616 -0.0656637 0.0062769 -0.0023798 0.0006199 0.0184117 0.0823773 0.0574624 0.0570294 -0.0212252 0.065544 0.0060715 0.0698904 -0.0509505 0.0001326 -0.0037044 -0.0280831 0.000218 0.0001222 0.0002185 0.1847461 0.0175414 0.0801497 0.0000002 0.0851786 0.0111283 0.0000895 -0.0000555 0.0001394 0.1731886 0.1147113 -0.0178859 0.0000634 -0.0500731 -0.0222655 0.0002225 0.0001067 0.0001927 0.185753 unknown
polarizability: 94.0460158|-5.1289993|57.9590706|-0.0152766|-0.0202822|37.6615661 unknown
InChI: InChI=1S/C5H5F3O2/c1-2-4(9)10-3-5(6,7)8/h2H,1,3H2
charge 0 multiplicity 1
15 atoms
F  2.232649 0.87569 -1.134603
F  3.154833 -0.86414 0.000922
F  2.231988 0.878147 1.132199
O  -0.315458 0.276611 -0.001017
O  -1.814545 -1.514302 0.001479
C  0.766333 -0.717507 0.000119
C  2.074241 0.056215 -0.000372
C  -1.618098 -0.276971 -0.000438
C  -2.621373 0.810758 -0.000823
C  -3.951096 0.532245 0.000261
H  0.712381 -1.358366 -0.89649
H  0.712083 -1.356709 0.897915
H  -2.232605 1.833437 -0.002032
H  -4.700543 1.329731 -0.000067
H  -4.30269 -0.506039 0.001448
