program: Orca
programVersion: 5.0.2
elementType: Si F O O C C C C C C C C C C C C C C C C C C C C C C C C C H H H H H H H H H H H H H H H H H H H H H H H H H H H H H
charge: 0
multiplicity: 1
keywords: wb97x-d3
keywords: def2-TZVPP
keywords: def2/J RIJCOSX
keywords: DEFGRID2
keywords: scfconv7
keywords: smallprint printgap noloewdin
keywords: NOSOSCF
formula: C25H29FO2Si
InChI: InChI=1/C25H29FO2Si/c1-4-27-21-13-15-23(16-14-21)29(2,3)18-8-9-20-12-17-24(26)25(19-20)28-22-10-6-5-7-11-22/h5-7,10-17,19H,4,8-9,18H2,1-3H3
58 atoms
Si -3.38922 1.140979 1.172117
F  1.542012 -4.541946 -0.353522
O  2.043737 3.645175 0.240593
O  1.732391 -2.225343 -1.780887
C  -3.407636 -0.541383 0.3171
C  -3.275323 -0.459725 -1.201617
C  -1.711312 1.94519 0.87249
C  -3.672026 0.905677 3.019408
C  -4.733511 2.260158 0.472282
C  -3.139287 -1.823843 -1.883499
C  -1.555041 3.33032 0.874706
C  -0.556273 1.184787 0.649473
C  -1.897609 -2.566289 -1.472444
C  -0.323826 3.944493 0.671659
C  0.678344 1.77052 0.440831
C  0.805995 3.160741 0.451449
C  -0.639203 -2.050824 -1.784084
C  -1.964271 -3.755159 -0.754753
C  0.514087 -2.713776 -1.407063
C  -0.81278 -4.43179 -0.368142
C  0.414299 -3.908961 -0.70596
C  2.241595 5.051978 0.205647
C  3.700148 5.308722 -0.080762
C  2.603029 -1.773796 -0.828388
C  2.244876 -1.542737 0.493218
C  3.899797 -1.52219 -1.26217
C  3.201797 -1.066413 1.380894
C  4.839992 -1.043058 -0.364852
C  4.499385 -0.81516 0.962837
H  -2.60164 -1.151805 0.739983
H  -4.334705 -1.062935 0.581334
H  -2.416355 0.160924 -1.475958
H  -4.150639 0.045468 -1.619496
H  -2.920172 0.247912 3.46115
H  -3.626512 1.856663 3.554843
H  -4.651065 0.464383 3.221111
H  -4.802782 3.20311 1.019248
H  -4.559781 2.505674 -0.577222
H  -5.714051 1.782744 0.538861
H  -4.017902 -2.433002 -1.657259
H  -3.13268 -1.67886 -2.967734
H  -2.413373 3.973242 1.037172
H  -0.611763 0.101364 0.631142
H  -0.268779 5.024871 0.685846
H  1.554514 1.157071 0.266726
H  -0.546045 -1.122993 -2.337452
H  -2.929332 -4.170343 -0.492184
H  -0.871539 -5.360272 0.185458
H  1.955504 5.499944 1.163387
H  1.615537 5.503933 -0.571305
H  3.879191 6.383521 -0.114205
H  4.342033 4.888239 0.694161
H  3.998124 4.891021 -1.042999
H  1.234839 -1.713651 0.843776
H  4.16597 -1.702849 -2.296273
H  2.918019 -0.887078 2.409957
H  5.848256 -0.850252 -0.708332
H  5.237413 -0.443539 1.661156
elementType: Si F O C H
totalener: -1510.07167427 hartree
nucrepener: 2889.70471788 hartree
electener: -4399.77639215 hartree
oneelecener: -7809.94126010 hartree
twoeener: 3410.16486795 hartree
cpcmener: -0.02373618 hartree
kineticenergy: 1503.91112046 hartree
xcener: -135.229672402049 hartree
chargesum: 0.0000000
charge: 0.479568 -0.216385 -0.322259 -0.325993 -0.267412 -0.137239 -0.186932 -0.419809 -0.450307 -0.097742 -0.127677 -0.051524 0.007386 -0.278370 -0.284740 0.346052 -0.264864 -0.159532 0.190875 -0.168479 0.244969 0.060994 -0.273477 0.338733 -0.230861 -0.249320 -0.174714 -0.122086 -0.178873 0.082646 0.091229 0.083044 0.092865 0.100760 0.099908 0.100534 0.106842 0.107769 0.110969 0.081798 0.100906 0.132790 0.128852 0.136738 0.122092 0.135243 0.140421 0.148963 0.093074 0.092630 0.088979 0.087443 0.087224 0.152758 0.143613 0.156734 0.156464 0.156729
qa: 0.4796 -0.2164 -0.3223 -0.3260 -0.2674 -0.1372 -0.1869 -0.4198 -0.4503 -0.0977 -0.1277 -0.0515 0.0074 -0.2784 -0.2847 0.3461 -0.2649 -0.1595 0.1909 -0.1685 0.2450 0.0610 -0.2735 0.3387 -0.2309 -0.2493 -0.1747 -0.1221 -0.1789 0.0826 0.0912 0.0830 0.0929 0.1008 0.0999 0.1005 0.1068 0.1078 0.1110 0.0818 0.1009 0.1328 0.1289 0.1367 0.1221 0.1352 0.1404 0.1490 0.0931 0.0926 0.0890 0.0874 0.0872 0.1528 0.1436 0.1567 0.1565 0.1567
va: 4.1492 1.0706 2.0872 2.0839 3.8528 3.8550 3.7904 3.8836 3.8962 3.8422 3.8925 3.7823 3.6377 3.9085 3.9835 3.8376 3.9541 3.8699 3.6981 3.9132 3.9789 3.8016 3.9752 3.6286 3.8364 3.9929 3.8920 3.9003 3.8997 1.0124 1.0150 1.0040 1.0082 1.0092 1.0101 1.0087 1.0103 1.0042 1.0066 1.0099 1.0040 0.9930 0.9781 1.0125 1.0307 1.0160 1.0028 0.9985 0.9857 0.9862 1.0059 1.0034 1.0035 1.0051 1.0098 0.9932 0.9891 0.9902
dispcorr: -0.030560428 hartree
energy: -1510.102234702330
dipole: -17.90058 16.81652 -1.08406 29.01290 -27.82871 1.18419 7.11201 -6.87562 0.23639
magnitude: 1.62277 au
magnitude: 4.12475 debye
