program: Orca
programVersion: 5.0.2
elementType: Si F O O C C C C C C C C C C C C C C C C C C C C C C C C C H H H H H H H H H H H H H H H H H H H H H H H H H H H H H
charge: 0
multiplicity: 1
keywords: wb97x-d3
keywords: def2-TZVPP
keywords: def2/J RIJCOSX
keywords: DEFGRID2
keywords: scfconv7
keywords: smallprint printgap noloewdin
keywords: NOSOSCF
formula: C25H29FO2Si
InChI: InChI=1/C25H29FO2Si/c1-4-27-21-13-15-23(16-14-21)29(2,3)18-8-9-20-12-17-24(26)25(19-20)28-22-10-6-5-7-11-22/h5-7,10-17,19H,4,8-9,18H2,1-3H3
58 atoms
Si -3.630648 1.098461 1.074569
F  0.830278 -1.903132 -3.53403
O  1.866597 2.898546 -0.716881
O  1.84894 -1.064439 -1.245067
C  -3.594229 -0.774689 0.847264
C  -2.571382 -1.466099 1.752819
C  -1.932007 1.723073 0.551788
C  -3.941789 1.544399 2.875423
C  -4.9610 1.848111 -0.027286
C  -2.060227 -2.801484 1.200349
C  -1.412571 1.404916 -0.710101
C  -1.109635 2.467925 1.393091
C  -1.280759 -2.619153 -0.072924
C  -0.15285 1.810086 -1.108871
C  0.162181 2.887541 1.016319
C  0.649544 2.560897 -0.246085
C  -0.048754 -1.967796 -0.037302
C  -1.784929 -3.026763 -1.303466
C  0.668879 -1.73925 -1.199876
C  -1.08236 -2.788729 -2.478425
C  0.135516 -2.150516 -2.414299
C  2.771211 3.633913 0.098451
C  2.48154 5.119448 0.105373
C  2.800712 -1.256131 -0.282157
C  3.574702 -0.152813 0.047056
C  3.040456 -2.49189 0.305777
C  4.591709 -0.285002 0.98024
C  4.054544 -2.6057 1.246507
C  4.831697 -1.508114 1.591153
H  -4.588403 -1.20628 1.000852
H  -3.358599 -0.957576 -0.207666
H  -3.013763 -1.636301 2.737505
H  -1.704342 -0.820166 1.928438
H  -3.178087 1.136547 3.540722
H  -3.972978 2.62438 3.033793
H  -4.903236 1.145034 3.207101
H  -5.952898 1.467299 0.22714
H  -4.994895 2.935797 0.065139
H  -4.786784 1.616913 -1.080638
H  -1.427052 -3.279419 1.953095
H  -2.902462 -3.475209 1.024145
H  -1.998335 0.816163 -1.408971
H  -1.453791 2.74297 2.383772
H  0.222249 1.546017 -2.090641
H  0.747332 3.464334 1.719789
H  0.351628 -1.627454 0.910996
H  -2.741606 -3.53157 -1.353377
H  -1.477935 -3.101636 -3.436384
H  3.75343 3.453356 -0.33939
H  2.797647 3.226643 1.113514
H  1.512113 5.359845 0.542235
H  3.244546 5.630996 0.693725
H  2.511743 5.528202 -0.905242
H  3.382508 0.797531 -0.432762
H  2.452168 -3.360811 0.039456
H  5.193323 0.578511 1.2334
H  4.23937 -3.567779 1.706746
H  5.620041 -1.607004 2.325552
elementType: Si F O C H
totalener: -1510.06878805 hartree
nucrepener: 2975.04163922 hartree
electener: -4485.11042727 hartree
oneelecener: -7981.06113373 hartree
twoeener: 3495.95070646 hartree
cpcmener: -0.02406623 hartree
kineticenergy: 1503.91664978 hartree
xcener: -135.233804404955 hartree
chargesum: 0.0000000
charge: 0.482035 -0.219011 -0.339687 -0.328685 -0.267147 -0.133541 -0.174870 -0.445189 -0.424397 -0.091911 -0.110894 -0.129726 0.024388 -0.301450 -0.229971 0.352460 -0.194112 -0.204153 0.185550 -0.155096 0.188684 0.036907 -0.259859 0.296417 -0.262516 -0.195244 -0.136832 -0.152432 -0.179932 0.093762 0.073677 0.092711 0.073715 0.105687 0.107275 0.109651 0.101460 0.101488 0.100304 0.098590 0.082445 0.130413 0.140437 0.129809 0.135861 0.145031 0.142326 0.147059 0.108940 0.091110 0.090180 0.093404 0.088520 0.162342 0.153593 0.154654 0.158986 0.156786
qa: 0.4820 -0.2190 -0.3397 -0.3287 -0.2671 -0.1335 -0.1749 -0.4452 -0.4244 -0.0919 -0.1109 -0.1297 0.0244 -0.3015 -0.2300 0.3525 -0.1941 -0.2042 0.1856 -0.1551 0.1887 0.0369 -0.2599 0.2964 -0.2625 -0.1952 -0.1368 -0.1524 -0.1799 0.0938 0.0737 0.0927 0.0737 0.1057 0.1073 0.1097 0.1015 0.1015 0.1003 0.0986 0.0824 0.1304 0.1404 0.1298 0.1359 0.1450 0.1423 0.1471 0.1089 0.0911 0.0902 0.0934 0.0885 0.1623 0.1536 0.1547 0.1590 0.1568
va: 4.1344 1.0654 2.0496 2.0313 3.8419 3.8739 3.7427 3.9174 3.8985 3.8623 3.8241 3.8701 3.6533 4.0054 3.9237 3.6925 3.8418 3.8601 3.5818 3.8763 4.0645 3.8366 3.9505 3.7419 3.9503 3.9094 3.9120 3.8972 3.9114 1.0144 1.0180 1.0067 1.0039 1.0055 1.0083 1.0087 1.0097 1.0088 1.0095 1.0045 1.0076 0.9911 0.9890 1.0196 1.0086 1.0069 1.0025 0.9981 0.9873 0.9934 1.0025 1.0078 1.0050 1.0115 0.9990 0.9926 0.9904 0.9907
dispcorr: -0.033328308 hartree
energy: -1510.102116360025
dipole: -16.09214 15.87738 -0.21477 16.10252 -16.10040 0.00212 21.97136 -20.18264 1.78872
magnitude: 1.80156 au
magnitude: 4.57921 debye
