program: Orca
programVersion: 5.0.2
elementType: Si F O O C C C C C C C C C C C C C C C C C C C C C C C C C H H H H H H H H H H H H H H H H H H H H H H H H H H H H H
charge: 0
multiplicity: 1
keywords: wb97x-d3
keywords: def2-TZVPP
keywords: def2/J RIJCOSX
keywords: DEFGRID2
keywords: scfconv7
keywords: smallprint printgap noloewdin
keywords: NOSOSCF
formula: C25H29FO2Si
InChI: InChI=1/C25H29FO2Si/c1-4-27-21-13-15-23(16-14-21)29(2,3)18-8-9-20-12-17-24(26)25(19-20)28-22-10-6-5-7-11-22/h5-7,10-17,19H,4,8-9,18H2,1-3H3
58 atoms
Si -3.571173 1.409421 0.094309
F  1.819306 -3.606868 -1.500237
O  2.09781 2.008141 2.135807
O  1.878951 -1.597868 0.358962
C  -3.772914 -0.199396 -0.889965
C  -4.088211 -1.454171 -0.074899
C  -1.811871 1.606549 0.732729
C  -4.778616 1.442857 1.53757
C  -3.931807 2.851735 -1.064278
C  -2.981905 -1.896996 0.882917
C  -1.482018 1.561707 2.090356
C  -0.75865 1.8073 -0.15968
C  -1.703571 -2.323209 0.210025
C  -0.177269 1.702091 2.532315
C  0.556481 1.959496 0.258601
C  0.858598 1.900272 1.617816
C  -0.489843 -1.724343 0.537144
C  -1.702382 -3.347707 -0.734624
C  0.696069 -2.150946 -0.039057
C  -0.523661 -3.780984 -1.323215
C  0.665979 -3.186513 -0.961071
C  3.18382 2.410567 1.308723
C  3.173786 3.894239 1.010495
C  2.67194 -0.968403 -0.560639
C  2.178686 -0.424452 -1.739247
C  4.018458 -0.855765 -0.238355
C  3.050003 0.232898 -2.597531
C  4.874563 -0.192987 -1.104243
C  4.397525 0.352322 -2.28922
H  -4.587381 -0.033862 -1.60417
H  -2.880835 -0.358335 -1.506386
H  -4.326118 -2.281395 -0.750893
H  -4.996024 -1.291096 0.512532
H  -5.807775 1.352815 1.181949
H  -4.613538 0.632257 2.250458
H  -4.71347 2.381931 2.091561
H  -4.958066 2.814886 -1.437254
H  -3.801048 3.812402 -0.561426
H  -3.272999 2.849429 -1.935659
H  -2.761776 -1.101987 1.599648
H  -3.35826 -2.736123 1.475934
H  -2.25674 1.4125 2.834303
H  -0.950362 1.853149 -1.226872
H  0.049157 1.661528 3.591321
H  1.323939 2.120128 -0.485856
H  -0.454746 -0.922941 1.266215
H  -2.630361 -3.833574 -1.010016
H  -0.524898 -4.58664 -2.046557
H  3.216254 1.822898 0.38724
H  4.077084 2.150416 1.877144
H  3.186291 4.481337 1.929681
H  4.066061 4.151795 0.438236
H  2.307363 4.198748 0.422585
H  1.127806 -0.493099 -1.991539
H  4.388631 -1.281824 0.685874
H  2.663307 0.657347 -3.51524
H  5.923363 -0.108047 -0.850196
H  5.069193 0.865116 -2.96492
elementType: Si F O C H
totalener: -1510.06779854 hartree
nucrepener: 3023.19679691 hartree
electener: -4533.26459545 hartree
oneelecener: -8076.96500378 hartree
twoeener: 3543.70040832 hartree
cpcmener: -0.02194518 hartree
kineticenergy: 1503.91254526 hartree
xcener: -135.236503806919 hartree
chargesum: -0.0000000
charge: 0.482327 -0.217946 -0.338942 -0.325125 -0.262239 -0.162625 -0.112253 -0.440909 -0.456246 -0.091935 -0.120711 -0.154091 -0.026372 -0.264139 -0.274509 0.333147 -0.204671 -0.156018 0.139277 -0.197022 0.286337 0.118717 -0.271858 0.317096 -0.184568 -0.264664 -0.173578 -0.122824 -0.167718 0.097221 0.080840 0.093335 0.089716 0.112781 0.102123 0.113240 0.102042 0.100364 0.099404 0.079798 0.103616 0.139006 0.129913 0.129165 0.144813 0.146680 0.140220 0.146655 0.014138 0.110249 0.092770 0.093764 0.091521 0.151603 0.140147 0.156697 0.155109 0.157134
qa: 0.4823 -0.2179 -0.3389 -0.3251 -0.2622 -0.1626 -0.1123 -0.4409 -0.4562 -0.0919 -0.1207 -0.1541 -0.0264 -0.2641 -0.2745 0.3331 -0.2047 -0.1560 0.1393 -0.1970 0.2863 0.1187 -0.2719 0.3171 -0.1846 -0.2647 -0.1736 -0.1228 -0.1677 0.0972 0.0808 0.0933 0.0897 0.1128 0.1021 0.1132 0.1020 0.1004 0.0994 0.0798 0.1036 0.1390 0.1299 0.1292 0.1448 0.1467 0.1402 0.1467 0.0141 0.1102 0.0928 0.0938 0.0915 0.1516 0.1401 0.1567 0.1551 0.1571
va: 4.0926 1.0672 2.0663 2.0507 3.8350 3.9026 3.6425 3.9122 3.9044 3.7922 3.8353 3.8673 3.6754 4.0241 3.8626 3.7073 3.8753 3.8765 3.7831 3.9478 3.9407 3.8412 3.9421 3.5229 3.8185 3.9541 3.9190 3.8687 3.8681 1.0060 1.0162 1.0021 1.0005 1.0078 1.0070 1.0090 1.0105 1.0106 1.0116 1.0155 1.0041 0.9894 0.9994 1.0157 0.9910 0.9974 1.0026 1.0005 1.0137 0.9931 1.0064 1.0086 1.0009 1.0045 1.0124 0.9913 0.9898 0.9895
dispcorr: -0.036075965 hartree
energy: -1510.103874507200
dipole: -19.95420 19.31474 -0.63946 22.94415 -22.44508 0.49907 1.90851 -2.61977 -0.71126
magnitude: 1.07883 au
magnitude: 2.74217 debye
