program: Orca
programVersion: 5.0.2
elementType: Si F O O C C C C C C C C C C C C C C C C C C C C C C C C C H H H H H H H H H H H H H H H H H H H H H H H H H H H H H
charge: 0
multiplicity: 1
keywords: wb97x-d3
keywords: def2-TZVPP
keywords: def2/J RIJCOSX
keywords: DEFGRID2
keywords: scfconv7
keywords: smallprint printgap noloewdin
keywords: NOSOSCF
formula: C25H29FO2Si
InChI: InChI=1/C25H29FO2Si/c1-4-27-21-13-15-23(16-14-21)29(2,3)18-8-9-20-12-17-24(26)25(19-20)28-22-10-6-5-7-11-22/h5-7,10-17,19H,4,8-9,18H2,1-3H3
58 atoms
Si -3.596749 1.332921 0.099675
F  1.59886 -2.853033 1.908555
O  2.245747 2.121224 1.470547
O  2.118859 -1.850479 -0.467931
C  -3.797542 -0.481225 -0.385864
C  -3.087099 -0.856413 -1.691272
C  -1.786489 1.587885 0.561393
C  -4.684737 1.716841 1.589497
C  -4.04272 2.464907 -1.336475
C  -2.624089 -2.32001 -1.74819
C  -1.116507 0.667282 1.368225
C  -1.049367 2.698107 0.132732
C  -1.491354 -2.56567 -0.791179
C  0.219557 0.81627 1.721265
C  0.281045 2.868944 0.470003
C  0.935173 1.914217 1.249923
C  -0.208959 -2.131546 -1.127937
C  -1.698814 -3.134973 0.459765
C  0.833414 -2.21222 -0.218817
C  -0.65725 -3.245837 1.372836
C  0.587778 -2.772548 1.030744
C  3.002369 1.123054 2.143555
C  4.457393 1.512058 2.061602
C  2.470441 -0.777744 -1.238808
C  1.642731 0.304724 -1.506686
C  3.779148 -0.795095 -1.709668
C  2.13722 1.365486 -2.25475
C  4.258716 0.274272 -2.448724
C  3.439431 1.360071 -2.730386
H  -3.405585 -1.071476 0.449986
H  -4.857755 -0.74592 -0.447391
H  -2.209447 -0.222656 -1.86111
H  -3.755341 -0.661771 -2.533609
H  -5.742736 1.560011 1.366569
H  -4.433864 1.081892 2.442279
H  -4.569234 2.753665 1.912846
H  -3.957574 3.520772 -1.07114
H  -3.408477 2.294302 -2.208736
H  -5.075892 2.298253 -1.650442
H  -3.462899 -2.982406 -1.520222
H  -2.30272 -2.553795 -2.766433
H  -1.635829 -0.209247 1.741214
H  -1.515493 3.452596 -0.491232
H  0.684794 0.062565 2.342504
H  0.833031 3.728588 0.108665
H  -0.032969 -1.718293 -2.113824
H  -2.682593 -3.493521 0.734895
H  -0.815756 -3.68665 2.348899
H  2.846176 0.145097 1.676344
H  2.681339 1.044684 3.18794
H  5.061892 0.767305 2.579514
H  4.797919 1.556603 1.026172
H  4.644503 2.478297 2.531562
H  0.626978 0.34566 -1.138767
H  4.417747 -1.641282 -1.488295
H  1.487025 2.2065 -2.458615
H  5.279276 0.254056 -2.808866
H  3.813342 2.192812 -3.311289
elementType: Si F O C H
totalener: -1510.06854923 hartree
nucrepener: 3063.81888970 hartree
electener: -4573.88743893 hartree
oneelecener: -8157.99269586 hartree
twoeener: 3584.10525693 hartree
cpcmener: -0.02140534 hartree
kineticenergy: 1503.90126981 hartree
xcener: -135.234910597932 hartree
chargesum: -0.0000000
charge: 0.466001 -0.221694 -0.325741 -0.322588 -0.274897 -0.134195 -0.186451 -0.418442 -0.441572 -0.088992 -0.157647 -0.020689 0.075928 -0.250822 -0.363832 0.379238 -0.252839 -0.264317 0.253973 -0.110105 0.131529 0.047536 -0.268117 0.341249 -0.173835 -0.268684 -0.163504 -0.123276 -0.181753 0.077018 0.095615 0.069418 0.093923 0.100586 0.099777 0.100756 0.105214 0.108064 0.110471 0.083578 0.094587 0.140545 0.138795 0.137824 0.130459 0.154074 0.144498 0.146459 0.076900 0.111537 0.090432 0.081454 0.091275 0.126084 0.141413 0.154740 0.155753 0.157289
qa: 0.4660 -0.2217 -0.3257 -0.3226 -0.2749 -0.1342 -0.1865 -0.4184 -0.4416 -0.0890 -0.1576 -0.0207 0.0759 -0.2508 -0.3638 0.3792 -0.2528 -0.2643 0.2540 -0.1101 0.1315 0.0475 -0.2681 0.3412 -0.1738 -0.2687 -0.1635 -0.1233 -0.1818 0.0770 0.0956 0.0694 0.0939 0.1006 0.0998 0.1008 0.1052 0.1081 0.1105 0.0836 0.0946 0.1405 0.1388 0.1378 0.1305 0.1541 0.1445 0.1465 0.0769 0.1115 0.0904 0.0815 0.0913 0.1261 0.1414 0.1547 0.1558 0.1573
va: 4.1359 1.0581 2.0609 2.0700 3.8383 3.8892 3.7504 3.8955 3.9107 3.8676 3.8448 3.7401 3.5770 3.8313 4.0154 3.6476 3.9231 3.9036 3.6391 3.8520 4.0017 3.8055 3.9722 3.5845 3.8333 3.9823 3.9213 3.8813 3.9258 1.0191 1.0143 1.0018 1.0076 1.0099 1.0100 1.0102 1.0089 1.0056 1.0086 1.0076 1.0070 0.9839 0.9860 1.0118 1.0172 1.0002 1.0018 0.9984 0.9883 0.9904 1.0061 1.0043 1.0045 0.9959 1.0115 0.9945 0.9896 0.9903
dispcorr: -0.037484601 hartree
energy: -1510.106033833863
dipole: -17.12578 16.30779 -0.81798 14.99004 -15.18873 -0.19869 -4.40732 3.94035 -0.46697
magnitude: 0.96262 au
magnitude: 2.44678 debye
