program: Orca
programVersion: 5.0.2
elementType: Si F O O C C C C C C C C C C C C C C C C C C C C C C C C C H H H H H H H H H H H H H H H H H H H H H H H H H H H H H
charge: 0
multiplicity: 1
keywords: wb97x-d3
keywords: def2-TZVPP
keywords: def2/J RIJCOSX
keywords: DEFGRID2
keywords: scfconv7
keywords: smallprint printgap noloewdin
keywords: NOSOSCF
formula: C25H29FO2Si
InChI: InChI=1/C25H29FO2Si/c1-4-27-21-13-15-23(16-14-21)29(2,3)18-8-9-20-12-17-24(26)25(19-20)28-22-10-6-5-7-11-22/h5-7,10-17,19H,4,8-9,18H2,1-3H3
58 atoms
Si -3.564551 1.420631 -0.229622
F  2.312739 -2.348814 0.825988
O  2.00622 2.258222 1.952402
O  1.566882 -2.104671 -1.808139
C  -3.483141 -0.285527 -1.059729
C  -3.844293 -1.478797 -0.166764
C  -1.884877 1.732452 0.555743
C  -4.930852 1.457817 1.069399
C  -3.897184 2.740536 -1.532187
C  -3.121059 -2.777708 -0.54904
C  -1.284883 0.765258 1.360905
C  -1.134027 2.882835 0.29682
C  -1.657686 -2.71989 -0.206146
C  0.000694 0.904376 1.862659
C  0.146743 3.048654 0.791329
C  0.736324 2.048534 1.564575
C  -0.694479 -2.428196 -1.165989
C  -1.243814 -2.89403 1.111395
C  0.645837 -2.306938 -0.830608
C  0.089913 -2.768302 1.466216
C  1.022688 -2.471761 0.495367
C  2.743006 1.176707 2.493437
C  4.192715 1.592261 2.570772
C  2.371976 -0.998512 -1.754863
C  1.947004 0.211645 -1.225228
C  3.637325 -1.125675 -2.310168
C  2.81156 1.297578 -1.248407
C  4.485659 -0.031429 -2.330056
C  4.080286 1.183621 -1.795473
H  -4.113709 -0.30037 -1.953741
H  -2.456115 -0.382624 -1.426179
H  -4.923685 -1.643316 -0.207252
H  -3.627847 -1.275965 0.886683
H  -5.904233 1.22194 0.635116
H  -4.750535 0.743377 1.873901
H  -5.005725 2.444434 1.528621
H  -3.134644 2.74053 -2.312652
H  -4.859257 2.569087 -2.017919
H  -3.930473 3.743299 -1.103131
H  -3.583107 -3.615618 -0.020264
H  -3.254577 -2.973196 -1.615882
H  -1.814153 -0.14887 1.60175
H  -1.546568 3.67116 -0.32211
H  0.414992 0.109635 2.467499
H  0.713565 3.944092 0.568389
H  -0.976213 -2.302184 -2.204466
H  -1.972638 -3.135014 1.87587
H  0.413397 -2.915126 2.488499
H  2.640868 0.289856 1.858539
H  2.364033 0.91828 3.489736
H  4.591767 1.796263 1.57779
H  4.321365 2.480806 3.188281
H  4.782759 0.788092 3.00949
H  0.954578 0.32153 -0.804785
H  3.948142 -2.078504 -2.71786
H  2.479424 2.241184 -0.838031
H  5.473117 -0.132649 -2.76077
H  4.745531 2.036389 -1.811478
totalener: -1510.04705478 hartree
nucrepener: 3039.73014750 hartree
electener: -4549.77720228 hartree
oneelecener: -8108.74852998 hartree
twoeener: 3558.97132770 hartree
kineticenergy: 1503.95065464 hartree
xcener: -135.238235601764 hartree
chargesum: 0.0000000
charge: 0.451510 -0.202225 -0.286328 -0.305494 -0.274472 -0.143207 -0.122055 -0.367355 -0.438514 -0.114500 -0.107190 -0.037557 0.160143 -0.242492 -0.244097 0.268821 -0.273098 -0.251531 0.206810 -0.169589 0.234013 0.021679 -0.248444 0.247039 -0.122929 -0.195453 -0.145830 -0.091317 -0.155835 0.091377 0.087873 0.089559 0.060498 0.093659 0.090100 0.100337 0.102617 0.095608 0.090599 0.093563 0.081065 0.111212 0.111185 0.106361 0.117487 0.121612 0.118673 0.128333 0.087741 0.094708 0.080889 0.087997 0.078916 0.125544 0.120047 0.134177 0.122603 0.125158
qa: 0.4515 -0.2022 -0.2863 -0.3055 -0.2745 -0.1432 -0.1221 -0.3674 -0.4385 -0.1145 -0.1072 -0.0376 0.1601 -0.2425 -0.2441 0.2688 -0.2731 -0.2515 0.2068 -0.1696 0.2340 0.0217 -0.2484 0.2470 -0.1229 -0.1955 -0.1458 -0.0913 -0.1558 0.0914 0.0879 0.0896 0.0605 0.0937 0.0901 0.1003 0.1026 0.0956 0.0906 0.0936 0.0811 0.1112 0.1112 0.1064 0.1175 0.1216 0.1187 0.1283 0.0877 0.0947 0.0809 0.0880 0.0789 0.1255 0.1200 0.1342 0.1226 0.1252
va: 4.1328 1.0880 2.0968 2.1051 3.8052 3.9067 3.8143 3.8812 3.9276 3.8558 3.9050 3.8447 3.4832 3.9103 4.0153 3.8289 4.0327 3.9271 3.7698 3.8703 3.9608 3.8399 3.9732 3.7962 3.8330 4.0364 3.9038 3.9467 3.9567 1.0097 1.0150 1.0111 1.0006 1.0097 1.0141 1.0141 1.0104 1.0170 1.0138 1.0066 1.0114 0.9876 0.9938 1.0184 1.0179 1.0188 1.0080 1.0041 0.9824 0.9895 1.0111 1.0062 1.0087 1.0068 1.0157 1.0070 0.9980 1.0005
dispcorr: -0.036683369 hartree
energy: -1510.083738152575
dipole: -19.01991 18.54326 -0.47665 12.94787 -13.19138 -0.24351 3.23050 -2.93433 0.29616
magnitude: 0.61173 au
magnitude: 1.55488 debye
