program: Orca
programVersion: 5.0.2
elementType: Si F O O C C C C C C C C C C C C C C C C C C C C C C C C C H H H H H H H H H H H H H H H H H H H H H H H H H H H H H
charge: 0
multiplicity: 1
keywords: wb97x-d3
keywords: def2-TZVPP
keywords: def2/J RIJCOSX
keywords: DEFGRID2
keywords: scfconv7
keywords: smallprint printgap noloewdin
keywords: NOSOSCF
formula: C25H29FO2Si
InChI: InChI=1/C25H29FO2Si/c1-4-27-21-13-15-23(16-14-21)29(2,3)18-8-9-20-12-17-24(26)25(19-20)28-22-10-6-5-7-11-22/h5-7,10-17,19H,4,8-9,18H2,1-3H3
58 atoms
Si -4.201629 1.626341 0.608047
F  2.272658 -3.724033 -0.697191
O  1.758285 2.598214 0.41315
O  2.00373 -1.325438 0.556545
C  -4.491425 -0.190491 1.120032
C  -3.280242 -1.11623 1.000311
C  -2.359961 2.001566 0.582241
C  -5.055046 2.746415 1.861652
C  -4.922072 1.939228 -1.106736
C  -2.783813 -1.289456 -0.435898
C  -1.585929 1.902312 1.736591
C  -1.682837 2.325214 -0.598134
C  -1.442213 -1.9628 -0.51602
C  -0.20978 2.09042 1.731096
C  -0.316901 2.526192 -0.629252
C  0.438586 2.403376 0.53757
C  -0.32272 -1.331601 0.02658
C  -1.274761 -3.199235 -1.123482
C  0.9243 -1.923417 -0.02666
C  -0.024709 -3.802015 -1.193964
C  1.062772 -3.16122 -0.645407
C  2.601152 2.347844 1.521038
C  4.025063 2.597624 1.086892
C  2.991396 -0.858312 -0.268505
C  2.705766 -0.186299 -1.448548
C  4.304094 -1.036788 0.143508
C  3.749522 0.300752 -2.220564
C  5.33711 -0.540412 -0.635602
C  5.066702 0.12637 -1.822425
H  -4.845227 -0.200544 2.155641
H  -5.324236 -0.587123 0.528495
H  -3.514117 -2.102538 1.411482
H  -2.465238 -0.726138 1.614296
H  -4.953806 3.797696 1.589674
H  -6.121435 2.525613 1.936574
H  -4.629623 2.627747 2.859762
H  -5.997249 1.75151 -1.109312
H  -4.774839 2.971266 -1.429101
H  -4.483892 1.28913 -1.865991
H  -3.521152 -1.854324 -1.012663
H  -2.707982 -0.31073 -0.918516
H  -2.055834 1.659618 2.684189
H  -2.232009 2.417545 -1.528167
H  0.337997 1.985157 2.657408
H  0.185921 2.774057 -1.555324
H  -0.416098 -0.361396 0.500672
H  -2.129468 -3.706764 -1.552736
H  0.104911 -4.766784 -1.665897
H  2.479731 1.31302 1.86137
H  2.33778 3.005835 2.358431
H  4.168126 3.633471 0.779961
H  4.702253 2.39511 1.916554
H  4.304292 1.947432 0.25954
H  1.679871 -0.033819 -1.758741
H  4.506757 -1.569023 1.063577
H  3.526526 0.827473 -3.139065
H  6.360798 -0.684571 -0.315667
H  5.87546 0.508788 -2.430153
totalener: -1510.04776815 hartree
nucrepener: 2992.11658852 hartree
electener: -4502.16435668 hartree
oneelecener: -8013.72062644 hartree
twoeener: 3511.55626976 hartree
kineticenergy: 1503.96367210 hartree
xcener: -135.240773428711 hartree
chargesum: -0.0000000
charge: 0.437111 -0.198314 -0.274341 -0.309695 -0.280759 -0.114284 -0.076078 -0.408271 -0.404913 -0.097714 -0.192170 -0.082134 0.041095 -0.163568 -0.249388 0.288496 -0.178121 -0.116202 0.075818 -0.169884 0.284883 0.003300 -0.247358 0.206286 -0.088689 -0.189762 -0.136208 -0.100393 -0.127118 0.096233 0.079587 0.088945 0.079315 0.095990 0.092613 0.088474 0.099932 0.101689 0.093452 0.082797 0.074352 0.110431 0.119410 0.104106 0.114727 0.076029 0.106196 0.119046 0.093499 0.101379 0.090348 0.079867 0.075997 0.120043 0.120263 0.120367 0.120523 0.122768
qa: 0.4371 -0.1983 -0.2743 -0.3097 -0.2808 -0.1143 -0.0761 -0.4083 -0.4049 -0.0977 -0.1922 -0.0821 0.0411 -0.1636 -0.2494 0.2885 -0.1781 -0.1162 0.0758 -0.1699 0.2849 0.0033 -0.2474 0.2063 -0.0887 -0.1898 -0.1362 -0.1004 -0.1271 0.0962 0.0796 0.0889 0.0793 0.0960 0.0926 0.0885 0.0999 0.1017 0.0935 0.0828 0.0744 0.1104 0.1194 0.1041 0.1147 0.0760 0.1062 0.1190 0.0935 0.1014 0.0903 0.0799 0.0760 0.1200 0.1203 0.1204 0.1205 0.1228
va: 4.1218 1.0989 2.1039 2.0494 3.8489 3.8533 3.7246 3.9005 3.8997 3.7608 3.9816 3.8460 3.6870 3.8734 4.0304 3.8309 3.8899 3.9210 3.9029 3.9707 3.9977 3.8379 3.9773 3.7013 3.8700 4.0105 3.9747 3.9147 3.9135 1.0082 1.0128 1.0126 1.0116 1.0143 1.0122 1.0152 1.0155 1.0097 1.0125 1.0157 1.0279 0.9988 0.9952 1.0206 1.0177 1.0193 1.0121 1.0088 0.9841 0.9896 1.0103 1.0088 1.0059 1.0080 1.0165 1.0031 1.0014 1.0013
dispcorr: -0.035418872 hartree
energy: -1510.083187024630
dipole: -20.65595 20.33351 -0.32244 19.51671 -19.27945 0.23725 5.55403 -5.47034 0.08369
magnitude: 0.40897 au
magnitude: 1.03953 debye
