program: Orca
programVersion: 5.0.2
elementType: Si F O O C C C C C C C C C C C C C C C C C C C C C C C C C H H H H H H H H H H H H H H H H H H H H H H H H H H H H H
charge: 0
multiplicity: 1
keywords: wb97x-d3
keywords: def2-TZVPP
keywords: def2/J RIJCOSX
keywords: DEFGRID2
keywords: scfconv7
keywords: smallprint printgap noloewdin
keywords: NOSOSCF
formula: C25H29FO2Si
InChI: InChI=1/C25H29FO2Si/c1-4-27-21-13-15-23(16-14-21)29(2,3)18-8-9-20-12-17-24(26)25(19-20)28-22-10-6-5-7-11-22/h5-7,10-17,19H,4,8-9,18H2,1-3H3
58 atoms
Si -3.281051 1.317523 0.944623
F  1.66708 -4.603211 0.495163
O  1.714598 3.875959 -1.299607
O  1.869788 -2.323559 -0.989083
C  -3.27756 -0.504888 0.433818
C  -3.173183 -0.711683 -1.075331
C  -1.727329 2.110249 0.252739
C  -3.282315 1.43308 2.827107
C  -4.800821 2.190555 0.25016
C  -3.003052 -2.175165 -1.490301
C  -1.734329 3.336093 -0.418196
C  -0.490385 1.482442 0.390874
C  -1.758158 -2.822826 -0.945204
C  -0.577002 3.903739 -0.916307
C  0.686179 2.0295 -0.100627
C  0.647905 3.254858 -0.761932
C  -0.504408 -2.263107 -1.1826
C  -1.821409 -3.993434 -0.198098
C  0.648187 -2.85943 -0.702666
C  -0.674271 -4.60412 0.289285
C  0.553656 -4.034519 0.030873
C  3.015894 3.37288 -1.071522
C  3.540135 3.705916 0.312443
C  2.458598 -1.489815 -0.089344
C  1.943457 -1.222724 1.172842
C  3.641431 -0.885601 -0.504115
C  2.621455 -0.349892 2.013899
C  4.304968 -0.019281 0.347259
C  3.800306 0.256511 1.61191
H  -2.437385 -0.998496 0.935675
H  -4.176227 -0.998057 0.820552
H  -2.341144 -0.123563 -1.473325
H  -4.067507 -0.319206 -1.567199
H  -4.153648 0.94334 3.265367
H  -2.393909 0.963386 3.252524
H  -3.286337 2.472491 3.157972
H  -5.71788 1.705905 0.589057
H  -4.853139 3.231956 0.572478
H  -4.812172 2.184779 -0.84083
H  -3.875604 -2.747713 -1.164879
H  -2.990287 -2.236332 -2.582956
H  -2.666837 3.869524 -0.562672
H  -0.418699 0.523867 0.894333
H  -0.605326 4.854327 -1.433474
H  1.61018 1.48567 0.044355
H  -0.406183 -1.347909 -1.755084
H  -2.784097 -4.444876 0.005931
H  -0.728519 -5.517695 0.866502
H  3.637883 3.851549 -1.82872
H  3.064235 2.294473 -1.256782
H  4.568629 3.356444 0.41064
H  3.533058 4.782384 0.481624
H  2.954963 3.232436 1.099976
H  1.024009 -1.683342 1.509528
H  4.032824 -1.105011 -1.488804
H  2.214629 -0.14482 2.995314
H  5.227436 0.44234 0.018857
H  4.32147 0.934365 2.274003
totalener: -1510.04958424 hartree
nucrepener: 2962.91547338 hartree
electener: -4472.96505762 hartree
oneelecener: -7954.91067917 hartree
twoeener: 3481.94562155 hartree
kineticenergy: 1503.94262836 hartree
xcener: -135.237904769121 hartree
chargesum: 0.0000000
charge: 0.424237 -0.192465 -0.292725 -0.297121 -0.259560 -0.114172 -0.115781 -0.374078 -0.426388 -0.126807 -0.050877 -0.147925 -0.004877 -0.239189 -0.112091 0.292072 -0.192894 -0.094778 0.142416 -0.169888 0.236576 0.058430 -0.274084 0.307740 -0.192354 -0.179705 -0.134892 -0.149822 -0.134934 0.075055 0.079146 0.081847 0.084956 0.090343 0.089481 0.095223 0.099734 0.096435 0.100582 0.070206 0.098913 0.107344 0.096586 0.110885 0.030603 0.119280 0.109036 0.122879 0.097141 0.062309 0.077305 0.102918 0.088948 0.122752 0.123667 0.124217 0.128044 0.130098
qa: 0.4242 -0.1925 -0.2927 -0.2971 -0.2596 -0.1142 -0.1158 -0.3741 -0.4264 -0.1268 -0.0509 -0.1479 -0.0049 -0.2392 -0.1121 0.2921 -0.1929 -0.0948 0.1424 -0.1699 0.2366 0.0584 -0.2741 0.3077 -0.1924 -0.1797 -0.1349 -0.1498 -0.1349 0.0751 0.0791 0.0818 0.0850 0.0903 0.0895 0.0952 0.0997 0.0964 0.1006 0.0702 0.0989 0.1073 0.0966 0.1109 0.0306 0.1193 0.1090 0.1229 0.0971 0.0623 0.0773 0.1029 0.0889 0.1228 0.1237 0.1242 0.1280 0.1301
va: 4.1841 1.1050 2.1216 2.1256 3.8337 3.8290 3.7879 3.8865 3.9121 3.8771 3.8842 3.8973 3.6944 4.0719 3.8298 3.8864 3.9611 3.9016 3.7680 3.9466 4.0449 3.8735 3.9139 3.7631 3.8555 3.9699 3.9503 3.8907 3.8623 1.0203 1.0211 1.0111 1.0097 1.0117 1.0130 1.0124 1.0121 1.0119 1.0076 1.0107 1.0024 0.9946 0.9929 1.0205 1.0497 1.0160 1.0098 1.0077 0.9927 1.0067 1.0112 1.0111 1.0041 1.0167 1.0156 1.0042 0.9992 0.9982
dispcorr: -0.034507912 hartree
energy: -1510.084092151853
dipole: -16.33799 16.05259 -0.28541 23.52123 -23.48928 0.03195 5.45254 -5.24770 0.20485
magnitude: 0.35276 au
magnitude: 0.89664 debye
