program: Orca
programVersion: 5.0.2
elementType: Si F O O C C C C C C C C C C C C C C C C C C C C C C C C C H H H H H H H H H H H H H H H H H H H H H H H H H H H H H
charge: 0
multiplicity: 1
keywords: wb97x-d3
keywords: def2-TZVPP
keywords: def2/J RIJCOSX
keywords: DEFGRID2
keywords: scfconv7
keywords: smallprint printgap noloewdin
keywords: NOSOSCF
formula: C25H29FO2Si
InChI: InChI=1/C25H29FO2Si/c1-4-27-21-13-15-23(16-14-21)29(2,3)18-8-9-20-12-17-24(26)25(19-20)28-22-10-6-5-7-11-22/h5-7,10-17,19H,4,8-9,18H2,1-3H3
58 atoms
Si -4.003766 1.57358 0.234756
F  2.156677 -4.176058 -0.155073
O  1.9122 2.276508 1.278923
O  2.002533 -1.640629 0.806542
C  -4.242325 0.168468 -1.033303
C  -3.085758 -0.824471 -1.145642
C  -2.170495 1.838473 0.549849
C  -4.86149 1.15834 1.862612
C  -4.761402 3.143942 -0.482814
C  -2.835191 -1.624305 0.134367
C  -1.294109 2.121018 -0.496861
C  -1.602805 1.726491 1.823023
C  -1.518445 -2.34431 0.090388
C  0.072084 2.275979 -0.308228
C  -0.246501 1.883389 2.039151
C  0.611516 2.158844 0.972623
C  -0.357203 -1.668652 0.459751
C  -1.40955 -3.650951 -0.368186
C  0.877306 -2.285341 0.384328
C  -0.17461 -4.279992 -0.454914
C  0.959097 -3.591965 -0.079856
C  2.861182 2.574084 0.270794
C  2.895545 4.047881 -0.086162
C  2.849721 -1.118978 -0.120879
C  4.123085 -0.786067 0.327355
C  2.491708 -0.891378 -1.443733
C  5.037096 -0.23401 -0.552374
C  3.421771 -0.337719 -2.313768
C  4.694713 -0.005693 -1.87906
H  -5.170866 -0.362232 -0.794278
H  -4.417168 0.623445 -2.013477
H  -2.168955 -0.289805 -1.405131
H  -3.263836 -1.524489 -1.967837
H  -5.927111 0.986837 1.700501
H  -4.459856 0.257936 2.330106
H  -4.774413 1.97171 2.585045
H  -5.815016 3.005258 -0.732405
H  -4.694788 3.974934 0.220538
H  -4.249145 3.451423 -1.396189
H  -2.83655 -0.951557 0.99577
H  -3.654874 -2.329808 0.295624
H  -1.675007 2.224045 -1.507979
H  -2.23113 1.504562 2.677978
H  0.696964 2.483802 -1.165852
H  0.168847 1.787168 3.034064
H  -0.408887 -0.647588 0.821278
H  -2.300135 -4.19385 -0.659695
H  -0.089472 -5.299833 -0.805734
H  2.702283 1.949746 -0.61389
H  3.819717 2.270398 0.689786
H  3.68184 4.228269 -0.819971
H  1.956176 4.398099 -0.513839
H  3.11072 4.656355 0.791865
H  4.386165 -0.969382 1.360751
H  1.500612 -1.138836 -1.800551
H  6.028948 0.014755 -0.197835
H  3.140315 -0.168225 -3.344991
H  5.414309 0.419885 -2.565044
totalener: -1510.04751227 hartree
nucrepener: 2991.73466181 hartree
electener: -4501.78217408 hartree
oneelecener: -8012.82018096 hartree
twoeener: 3511.03800688 hartree
kineticenergy: 1503.95395342 hartree
xcener: -135.240637045541 hartree
chargesum: -0.0000000
charge: 0.436537 -0.195892 -0.289916 -0.290204 -0.285995 -0.110938 -0.087871 -0.403458 -0.407497 -0.105966 -0.204828 -0.086270 0.011624 -0.170966 -0.209244 0.298168 -0.109281 -0.114781 0.072942 -0.185677 0.278550 0.048704 -0.253260 0.272470 -0.170181 -0.146349 -0.151575 -0.158612 -0.118683 0.079493 0.095705 0.075408 0.089003 0.098936 0.095484 0.100119 0.091956 0.094969 0.088479 0.066765 0.088566 0.111776 0.115723 0.106905 0.111267 0.064508 0.112569 0.120122 0.046555 0.107418 0.083856 0.084895 0.091053 0.120171 0.123896 0.125255 0.123478 0.124120
qa: 0.4365 -0.1959 -0.2899 -0.2902 -0.2860 -0.1109 -0.0879 -0.4035 -0.4075 -0.1060 -0.2048 -0.0863 0.0116 -0.1710 -0.2092 0.2982 -0.1093 -0.1148 0.0729 -0.1857 0.2785 0.0487 -0.2533 0.2725 -0.1702 -0.1463 -0.1516 -0.1586 -0.1187 0.0795 0.0957 0.0754 0.0890 0.0989 0.0955 0.1001 0.0920 0.0950 0.0885 0.0668 0.0886 0.1118 0.1157 0.1069 0.1113 0.0645 0.1126 0.1201 0.0466 0.1074 0.0839 0.0849 0.0911 0.1202 0.1239 0.1253 0.1235 0.1241
va: 4.1315 1.1011 2.0979 2.1076 3.8583 3.8419 3.7307 3.8985 3.9011 3.7964 3.9866 3.8401 3.7183 3.8643 4.0392 3.7987 3.8524 3.9098 3.8664 3.9689 4.0244 3.8840 3.9605 3.7159 3.9506 3.8344 3.9432 3.9531 3.8900 1.0140 1.0083 1.0157 1.0116 1.0161 1.0120 1.0099 1.0123 1.0149 1.0154 1.0301 1.0123 0.9961 0.9968 1.0121 1.0212 1.0451 1.0084 1.0086 0.9986 0.9939 1.0098 1.0044 1.0068 1.0175 1.0133 1.0000 1.0016 1.0001
dispcorr: -0.035073067 hartree
energy: -1510.082585332954
dipole: -21.75071 21.38205 -0.36866 25.32125 -24.86076 0.46049 -4.98169 4.29757 -0.68413
magnitude: 0.90332 au
magnitude: 2.29606 debye
