program: Orca
programVersion: 5.0.2
elementType: Si F O O C C C C C C C C C C C C C C C C C C C C C C C C C H H H H H H H H H H H H H H H H H H H H H H H H H H H H H
charge: 0
multiplicity: 1
keywords: wb97x-d3
keywords: def2-TZVPP
keywords: def2/J RIJCOSX
keywords: DEFGRID2
keywords: scfconv7
keywords: smallprint printgap noloewdin
keywords: NOSOSCF
formula: C25H29FO2Si
InChI: InChI=1/C25H29FO2Si/c1-4-27-21-13-15-23(16-14-21)29(2,3)18-8-9-20-12-17-24(26)25(19-20)28-22-10-6-5-7-11-22/h5-7,10-17,19H,4,8-9,18H2,1-3H3
58 atoms
Si -2.780655 1.373523 0.998654
F  1.06473 -5.234827 -0.14134
O  2.341497 4.02291 -0.789764
O  1.837644 -2.692499 -0.693452
C  -2.887661 -0.295945 0.112536
C  -2.711689 -0.21348 -1.401527
C  -1.222306 2.247442 0.431136
C  -2.694861 1.058113 2.855727
C  -4.284645 2.438521 0.598415
C  -2.73396 -1.573163 -2.105418
C  0.02049 1.609466 0.530111
C  -1.227709 3.528635 -0.108963
C  -1.714031 -2.55593 -1.591342
C  1.189946 2.214826 0.119069
C  -0.063123 4.162138 -0.528595
C  1.157383 3.504431 -0.414838
C  -0.391937 -2.175281 -1.381047
C  -2.066531 -3.871828 -1.310531
C  0.544131 -3.072836 -0.895356
C  -1.136458 -4.786388 -0.838693
C  0.163805 -4.378879 -0.625461
C  2.380472 5.325601 -1.3286
C  3.818262 5.654433 -1.655698
C  2.124962 -1.939025 0.404739
C  1.284657 -1.841178 1.50716
C  3.335454 -1.256086 0.38502
C  1.662054 -1.048037 2.58238
C  3.697386 -0.471556 1.466719
C  2.861964 -0.3559 2.569805
H  -2.120666 -0.951684 0.539023
H  -3.843727 -0.773579 0.355854
H  -1.778816 0.307119 -1.63512
H  -3.501511 0.404693 -1.837967
H  -1.806935 0.479657 3.117283
H  -2.646487 1.993294 3.415204
H  -3.563603 0.503115 3.214082
H  -4.357979 2.666423 -0.466087
H  -5.20634 1.929987 0.884863
H  -4.262023 3.387615 1.136148
H  -3.728862 -2.014985 -2.005423
H  -2.57966 -1.419833 -3.178296
H  0.090721 0.608944 0.941874
H  -2.161521 4.069125 -0.213376
H  2.136222 1.697204 0.210952
H  -0.130873 5.160346 -0.939189
H  -0.070323 -1.159486 -1.581774
H  -3.089374 -4.193575 -1.460919
H  -1.418719 -5.807807 -0.620778
H  1.979843 6.051265 -0.60996
H  1.762071 5.388275 -2.232498
H  3.883912 6.662317 -2.064905
H  4.444827 5.610911 -0.765556
H  4.223476 4.964032 -2.394506
H  0.342134 -2.37191 1.538245
H  3.981158 -1.343084 -0.478882
H  1.001521 -0.972443 3.436433
H  4.638776 0.061534 1.441695
H  3.143799 0.26752 3.406908
totalener: -1510.04957272 hartree
nucrepener: 2915.33637155 hartree
electener: -4425.38594427 hartree
oneelecener: -7860.04697181 hartree
twoeener: 3434.66102753 hartree
kineticenergy: 1503.96045128 hartree
xcener: -135.238620182046 hartree
chargesum: -0.0000000
charge: 0.410019 -0.191716 -0.279943 -0.299135 -0.252587 -0.109008 -0.181161 -0.373334 -0.423958 -0.130763 0.000367 -0.041737 0.021150 -0.259581 -0.255658 0.338961 -0.204489 -0.112393 0.162059 -0.166897 0.217539 0.045643 -0.258997 0.267362 -0.145206 -0.183446 -0.149513 -0.133245 -0.126255 0.073984 0.080194 0.080232 0.084616 0.084403 0.095898 0.091674 0.094030 0.098911 0.097131 0.069759 0.094173 0.067983 0.110982 0.112605 0.099878 0.121301 0.107768 0.121539 0.077863 0.077587 0.077739 0.086273 0.086322 0.124660 0.123501 0.124672 0.126704 0.123537
qa: 0.4100 -0.1917 -0.2799 -0.2991 -0.2526 -0.1090 -0.1812 -0.3733 -0.4240 -0.1308 0.0004 -0.0417 0.0211 -0.2596 -0.2557 0.3390 -0.2045 -0.1124 0.1621 -0.1669 0.2175 0.0456 -0.2590 0.2674 -0.1452 -0.1834 -0.1495 -0.1332 -0.1263 0.0740 0.0802 0.0802 0.0846 0.0844 0.0959 0.0917 0.0940 0.0989 0.0971 0.0698 0.0942 0.0680 0.1110 0.1126 0.0999 0.1213 0.1078 0.1215 0.0779 0.0776 0.0777 0.0863 0.0863 0.1247 0.1235 0.1247 0.1267 0.1235
va: 4.1672 1.1062 2.1299 2.1225 3.8397 3.8333 3.8304 3.8916 3.9190 3.8779 3.7856 3.8674 3.6948 4.0516 3.9546 3.8813 3.9597 3.9249 3.7326 3.9307 4.0822 3.8469 3.9838 3.7893 3.8120 3.9823 3.9115 3.9274 3.9164 1.0182 1.0208 1.0110 1.0089 1.0149 1.0124 1.0116 1.0105 1.0141 1.0116 1.0090 1.0016 0.9966 0.9957 1.0332 1.0225 1.0155 1.0089 1.0076 0.9851 0.9848 1.0072 1.0058 1.0055 1.0181 1.0144 1.0036 0.9990 1.0010
dispcorr: -0.032129326 hartree
energy: -1510.081702045690
dipole: -14.98351 14.31844 -0.66507 33.11758 -32.07361 1.04398 1.43553 -1.67572 -0.24019
magnitude: 1.26091 au
magnitude: 3.20498 debye
