program: Orca
programVersion: 5.0.2
elementType: Si F O O C C C C C C C C C C C C C C C C C C C C C C C C C H H H H H H H H H H H H H H H H H H H H H H H H H H H H H
charge: 0
multiplicity: 1
keywords: wb97x-d3
keywords: def2-TZVPP
keywords: def2/J RIJCOSX
keywords: DEFGRID2
keywords: scfconv7
keywords: smallprint printgap noloewdin
keywords: NOSOSCF
formula: C25H29FO2Si
InChI: InChI=1/C25H29FO2Si/c1-4-27-21-13-15-23(16-14-21)29(2,3)18-8-9-20-12-17-24(26)25(19-20)28-22-10-6-5-7-11-22/h5-7,10-17,19H,4,8-9,18H2,1-3H3
58 atoms
Si -3.623184 1.818346 0.116253
F  1.721537 -4.951617 -1.771014
O  1.844865 3.489384 2.063761
O  2.214497 -2.752488 -0.269991
C  -3.784882 0.007795 0.659394
C  -2.723561 -0.881521 0.014755
C  -1.927676 2.418704 0.654186
C  -4.970872 2.848859 0.935076
C  -3.768424 1.937849 -1.760163
C  -2.571632 -2.259837 0.66356
C  -1.733758 3.141469 1.836062
C  -0.781167 2.081274 -0.063573
C  -1.433267 -3.028246 0.050877
C  -0.474775 3.495309 2.280975
C  0.496027 2.411526 0.367796
C  0.656129 3.123449 1.553083
C  -0.130862 -2.556096 0.190124
C  -1.638903 -4.178938 -0.700904
C  0.93424 -3.195118 -0.421209
C  -0.579264 -4.839696 -1.306122
C  0.698795 -4.337885 -1.173777
C  3.02406 3.093417 1.393647
C  4.205679 3.580147 2.199472
C  2.570785 -1.543919 -0.785272
C  3.75319 -0.996602 -0.299823
C  1.840317 -0.875674 -1.760737
C  4.20639 0.212663 -0.798364
C  2.3071 0.337747 -2.247619
C  3.486414 0.890721 -1.7733
H  -3.678039 -0.019872 1.749805
H  -4.788834 -0.372896 0.445536
H  -1.751525 -0.383521 0.063634
H  -2.937578 -1.010745 -1.050313
H  -4.952905 2.760599 2.02252
H  -4.87263 3.907206 0.689332
H  -5.960339 2.528037 0.605453
H  -3.656906 2.969074 -2.097664
H  -3.007117 1.346382 -2.271451
H  -4.738921 1.580013 -2.108164
H  -2.396974 -2.129477 1.735832
H  -3.502258 -2.825069 0.570505
H  -2.587149 3.440566 2.434057
H  -0.864777 1.534204 -0.996412
H  -0.349701 4.056072 3.198533
H  1.344116 2.098729 -0.226657
H  0.065907 -1.66651 0.778822
H  -2.641565 -4.570137 -0.818524
H  -0.741357 -5.735948 -1.889979
H  3.05219 3.517082 0.382213
H  3.057896 2.002976 1.285429
H  4.204977 4.66584 2.290504
H  4.203644 3.151851 3.201301
H  5.133395 3.284274 1.70985
H  4.3125 -1.529312 0.457923
H  0.921517 -1.29316 -2.150574
H  5.132346 0.62735 -0.421063
H  1.739088 0.849557 -3.013694
H  3.8451 1.833312 -2.164247
totalener: -1510.04992246 hartree
nucrepener: 2888.40726073 hartree
electener: -4398.45718319 hartree
oneelecener: -7805.71428663 hartree
twoeener: 3407.25710344 hartree
kineticenergy: 1503.94453714 hartree
xcener: -135.235277119425 hartree
chargesum: -0.0000000
charge: 0.445313 -0.191947 -0.284064 -0.295394 -0.233020 -0.084243 -0.092237 -0.430855 -0.385529 -0.105613 -0.068335 -0.187363 0.033772 -0.233081 -0.148277 0.286225 -0.187072 -0.141740 0.135333 -0.159320 0.211173 0.061867 -0.256811 0.265082 -0.162804 -0.139701 -0.158296 -0.168304 -0.129924 0.070162 0.077644 0.035226 0.085232 0.088076 0.103700 0.094854 0.104625 0.084374 0.096314 0.088556 0.069122 0.106504 0.112981 0.111990 0.076675 0.127548 0.110211 0.122016 0.075906 0.074119 0.087594 0.086460 0.074365 0.126195 0.125549 0.127692 0.131777 0.129699
qa: 0.4453 -0.1919 -0.2841 -0.2954 -0.2330 -0.0842 -0.0922 -0.4309 -0.3855 -0.1056 -0.0683 -0.1874 0.0338 -0.2331 -0.1483 0.2862 -0.1871 -0.1417 0.1353 -0.1593 0.2112 0.0619 -0.2568 0.2651 -0.1628 -0.1397 -0.1583 -0.1683 -0.1299 0.0702 0.0776 0.0352 0.0852 0.0881 0.1037 0.0949 0.1046 0.0844 0.0963 0.0886 0.0691 0.1065 0.1130 0.1120 0.0767 0.1275 0.1102 0.1220 0.0759 0.0741 0.0876 0.0865 0.0744 0.1262 0.1255 0.1277 0.1318 0.1297
va: 4.1803 1.1068 2.1339 2.1236 3.8261 3.8626 3.7884 3.9309 3.8840 3.8582 3.9180 4.0029 3.7027 4.0646 3.8647 3.8970 3.9527 3.9346 3.7577 3.9147 4.1018 3.8443 3.9791 3.8187 3.9691 3.8602 3.9198 3.9163 3.8388 1.0190 1.0169 1.0238 1.0079 1.0142 1.0108 1.0152 1.0110 1.0147 1.0105 1.0065 1.0171 0.9960 0.9913 1.0199 1.0461 1.0060 1.0109 1.0075 0.9860 0.9908 1.0064 1.0061 1.0077 1.0130 1.0106 0.9980 1.0004 1.0003
dispcorr: -0.031271997 hartree
energy: -1510.081194461445
dipole: -16.68360 16.32753 -0.35607 27.31601 -27.00399 0.31201 5.84806 -5.95696 -0.10891
magnitude: 0.48580 au
magnitude: 1.23479 debye
