program: Orca
programVersion: 5.0.2
elementType: Si F O O C C C C C C C C C C C C C C C C C C C C C C C C C H H H H H H H H H H H H H H H H H H H H H H H H H H H H H
charge: 0
multiplicity: 1
keywords: wb97x-d3
keywords: def2-TZVPP
keywords: def2/J RIJCOSX
keywords: DEFGRID2
keywords: scfconv7
keywords: smallprint printgap noloewdin
keywords: NOSOSCF
formula: C25H29FO2Si
InChI: InChI=1/C25H29FO2Si/c1-4-27-21-13-15-23(16-14-21)29(2,3)18-8-9-20-12-17-24(26)25(19-20)28-22-10-6-5-7-11-22/h5-7,10-17,19H,4,8-9,18H2,1-3H3
58 atoms
Si -3.552085 1.76695 0.709899
F  1.770722 -5.114158 -0.064487
O  1.833417 3.862855 -1.048399
O  2.150928 -2.528099 -0.783644
C  -3.841182 0.252805 -0.395983
C  -2.787596 -0.824139 -0.146452
C  -1.870323 2.470294 0.258179
C  -3.550772 1.231125 2.516837
C  -4.899085 3.050441 0.416995
C  -2.677943 -1.886927 -1.242552
C  -1.730468 3.508135 -0.669891
C  -0.691063 1.917598 0.755406
C  -1.503394 -2.791636 -0.99205
C  -0.492684 3.95998 -1.083688
C  0.565708 2.343325 0.346615
C  0.670649 3.373984 -0.583199
C  -0.21498 -2.265937 -1.040872
C  -1.654855 -4.129163 -0.646308
C  0.888599 -3.040041 -0.72925
C  -0.55558 -4.922983 -0.348978
C  0.708443 -4.371383 -0.379004
C  3.042701 3.280877 -0.606791
C  4.183837 3.993289 -1.294653
C  2.532004 -1.608637 0.14484
C  1.832374 -1.364886 1.320816
C  3.702333 -0.909648 -0.13001
C  2.317007 -0.42234 2.217349
C  4.173047 0.02496 0.776268
C  3.483185 0.279077 1.954435
H  -4.849554 -0.150532 -0.26005
H  -3.78791 0.589295 -1.437648
H  -2.974967 -1.318927 0.811036
H  -1.804948 -0.354916 -0.047829
H  -2.783542 0.483542 2.725743
H  -3.367314 2.0777 3.17985
H  -4.509439 0.792587 2.799941
H  -5.876102 2.660419 0.707465
H  -4.722912 3.956186 0.998959
H  -4.971534 3.342529 -0.631826
H  -3.601247 -2.468109 -1.303201
H  -2.562305 -1.388281 -2.209492
H  -2.610931 3.984247 -1.086885
H  -0.730483 1.120024 1.489553
H  -0.409007 4.7665 -1.801101
H  1.439842 1.856782 0.758965
H  -0.058762 -1.227151 -1.312101
H  -2.64577 -4.563503 -0.603587
H  -0.676757 -5.963836 -0.079328
H  3.062232 2.209798 -0.83992
H  3.138448 3.372757 0.482227
H  4.117939 3.893102 -2.377634
H  4.195011 5.054849 -1.048742
H  5.133391 3.564233 -0.974526
H  0.922657 -1.903778 1.549381
H  4.238552 -1.111848 -1.047974
H  1.771551 -0.241281 3.134454
H  5.088542 0.559873 0.557834
H  3.854399 1.008425 2.661544
totalener: -1510.04961578 hartree
nucrepener: 2904.46273557 hartree
electener: -4414.51235135 hartree
oneelecener: -7837.84981712 hartree
twoeener: 3423.33746578 hartree
kineticenergy: 1503.94826108 hartree
xcener: -135.236446771149 hartree
chargesum: 0.0000000
charge: 0.443293 -0.192059 -0.283802 -0.297049 -0.233465 -0.078515 -0.088371 -0.386730 -0.428123 -0.106099 -0.069186 -0.185912 0.031726 -0.231563 -0.139625 0.286051 -0.187581 -0.138345 0.134517 -0.160968 0.216343 0.063180 -0.256064 0.270079 -0.139690 -0.158929 -0.177439 -0.176495 -0.109593 0.077886 0.068815 0.084992 0.027136 0.084254 0.104727 0.096981 0.094815 0.103076 0.087376 0.069643 0.087478 0.104934 0.113537 0.111796 0.065372 0.128149 0.110787 0.121961 0.072840 0.076410 0.086863 0.087669 0.073877 0.125860 0.126310 0.128909 0.129933 0.128030
qa: 0.4433 -0.1921 -0.2838 -0.2970 -0.2335 -0.0785 -0.0884 -0.3867 -0.4281 -0.1061 -0.0692 -0.1859 0.0317 -0.2316 -0.1396 0.2861 -0.1876 -0.1383 0.1345 -0.1610 0.2163 0.0632 -0.2561 0.2701 -0.1397 -0.1589 -0.1774 -0.1765 -0.1096 0.0779 0.0688 0.0850 0.0271 0.0843 0.1047 0.0970 0.0948 0.1031 0.0874 0.0696 0.0875 0.1049 0.1135 0.1118 0.0654 0.1281 0.1108 0.1220 0.0728 0.0764 0.0869 0.0877 0.0739 0.1259 0.1263 0.1289 0.1299 0.1280
va: 4.1812 1.1067 2.1345 2.1252 3.8271 3.8652 3.7825 3.8858 3.9298 3.8615 3.9232 3.9958 3.7047 4.0612 3.8642 3.8991 3.9556 3.9336 3.7572 3.9153 4.0990 3.8431 3.9780 3.8157 3.8475 3.9443 3.9306 3.9286 3.8299 1.0168 1.0197 1.0086 1.0241 1.0144 1.0115 1.0105 1.0149 1.0110 1.0151 1.0171 1.0075 0.9961 0.9911 1.0202 1.0445 1.0055 1.0106 1.0074 0.9912 0.9870 1.0059 1.0063 1.0077 1.0111 1.0132 1.0015 0.9970 1.0005
dispcorr: -0.031844847 hartree
energy: -1510.081460623199
dipole: -16.44240 16.07789 -0.36450 26.93990 -26.72099 0.21891 4.53862 -4.28563 0.25298
magnitude: 0.49476 au
magnitude: 1.25757 debye
