program: Orca
programVersion: 5.0.2
elementType: Si F O O C C C C C C C C C C C C C C C C C C C C C C C C C H H H H H H H H H H H H H H H H H H H H H H H H H H H H H
charge: 0
multiplicity: 1
keywords: wb97x-d3
keywords: def2-TZVPP
keywords: def2/J RIJCOSX
keywords: DEFGRID2
keywords: scfconv7
keywords: smallprint printgap noloewdin
keywords: NOSOSCF
formula: C25H29FO2Si
InChI: InChI=1/C25H29FO2Si/c1-4-27-21-13-15-23(16-14-21)29(2,3)18-8-9-20-12-17-24(26)25(19-20)28-22-10-6-5-7-11-22/h5-7,10-17,19H,4,8-9,18H2,1-3H3
58 atoms
Si -3.346597 1.404736 -0.025537
F  1.419169 -3.04857 1.973276
O  2.186543 1.629709 2.409029
O  2.036721 -1.854776 -0.303275
C  -3.702496 -0.375139 -0.552836
C  -2.976155 -0.804598 -1.832996
C  -1.588564 1.484034 0.641701
C  -4.551353 1.904499 1.337462
C  -3.533609 2.575753 -1.492209
C  -2.607747 -2.29504 -1.859852
C  -0.761776 2.587676 0.440489
C  -1.070589 0.454811 1.439035
C  -1.534715 -2.600243 -0.85148
C  0.50784 2.682509 0.999063
C  0.185823 0.527385 2.006387
C  0.990776 1.648228 1.796999
C  -0.239155 -2.149657 -1.095039
C  -1.804471 -3.236139 0.351644
C  0.758793 -2.273181 -0.144088
C  -0.804098 -3.402634 1.302995
C  0.457964 -2.914425 1.054925
C  3.137403 2.645266 2.160122
C  3.856117 2.466825 0.837382
C  2.362121 -0.824058 -1.136614
C  1.561415 0.296563 -1.321128
C  3.595614 -0.917359 -1.76794
C  2.000282 1.30974 -2.159703
C  4.026983 0.111252 -2.589637
C  3.228828 1.226742 -2.7980
H  -3.407051 -1.017905 0.283415
H  -4.779872 -0.529529 -0.663176
H  -2.054235 -0.229321 -1.972561
H  -3.599699 -0.570425 -2.698981
H  -5.587279 1.878274 0.994824
H  -4.472034 1.238899 2.198505
H  -4.347265 2.91505 1.694158
H  -2.832473 2.341179 -2.29445
H  -4.539986 2.512886 -1.909351
H  -3.372098 3.616861 -1.208424
H  -3.496859 -2.900026 -1.665011
H  -2.260689 -2.564574 -2.861092
H  -1.104149 3.414232 -0.172406
H  -1.655426 -0.439717 1.622565
H  1.10148 3.563847 0.797209
H  0.566583 -0.28458 2.612641
H  -0.016842 -1.672025 -2.04126
H  -2.801824 -3.60333 0.557905
H  -1.005007 -3.900308 2.242525
H  3.848132 2.569167 2.983557
H  2.680795 3.638749 2.232098
H  4.632795 3.225738 0.734378
H  4.331388 1.487962 0.782347
H  3.187739 2.552955 -0.017701
H  0.610552 0.392988 -0.814301
H  4.210034 -1.793238 -1.605657
H  1.370641 2.179165 -2.29809
H  4.990365 0.033347 -3.076219
H  3.563644 2.025157 -3.44637
totalener: -1510.04585177 hartree
nucrepener: 3073.87762327 hartree
electener: -4583.92347504 hartree
oneelecener: -8177.23727344 hartree
twoeener: 3593.31379840 hartree
kineticenergy: 1503.94513653 hartree
xcener: -135.244933618792 hartree
chargesum: -0.0000000
charge: 0.411204 -0.195357 -0.283950 -0.287578 -0.265845 -0.110406 -0.099661 -0.376350 -0.409980 -0.127010 -0.123499 -0.088613 0.118395 -0.239548 -0.219702 0.320964 -0.239019 -0.265408 0.270601 -0.080676 0.091222 0.022009 -0.239195 0.290627 -0.141478 -0.196899 -0.207682 -0.105655 -0.117628 0.069350 0.091012 0.056320 0.089562 0.088985 0.093286 0.094152 0.100893 0.100840 0.093410 0.076218 0.093659 0.104942 0.110215 0.104033 0.121627 0.131868 0.116093 0.122348 0.099369 0.068297 0.087361 0.092027 0.071622 0.115106 0.125806 0.129250 0.123994 0.124471
qa: 0.4112 -0.1954 -0.2840 -0.2876 -0.2658 -0.1104 -0.0997 -0.3764 -0.4100 -0.1270 -0.1235 -0.0886 0.1184 -0.2395 -0.2197 0.3210 -0.2390 -0.2654 0.2706 -0.0807 0.0912 0.0220 -0.2392 0.2906 -0.1415 -0.1969 -0.2077 -0.1057 -0.1176 0.0693 0.0910 0.0563 0.0896 0.0890 0.0933 0.0942 0.1009 0.1008 0.0934 0.0762 0.0937 0.1049 0.1102 0.1040 0.1216 0.1319 0.1161 0.1223 0.0994 0.0683 0.0874 0.0920 0.0716 0.1151 0.1258 0.1292 0.1240 0.1245
va: 4.1832 1.0947 2.1183 2.1291 3.8429 3.8703 3.7223 3.8958 3.9022 3.9067 3.8793 3.8280 3.5743 3.8902 3.9746 3.7963 3.9312 3.9505 3.6614 3.8506 4.0658 3.9220 3.9010 3.7471 3.7883 4.0101 3.9576 3.9402 3.9311 1.0248 1.0153 1.0070 1.0090 1.0128 1.0132 1.0140 1.0085 1.0127 1.0135 1.0105 1.0078 0.9997 0.9872 1.0151 1.0233 1.0046 1.0112 1.0058 0.9929 0.9954 1.0148 1.0060 1.0067 0.9940 1.0147 1.0057 0.9994 1.0006
dispcorr: -0.038129716 hartree
energy: -1510.083981486440
dipole: -16.43325 16.18499 -0.24826 21.59890 -20.88291 0.71599 -10.15274 9.44632 -0.70642
magnitude: 1.03601 au
magnitude: 2.63333 debye
