program: Orca
programVersion: 5.0.2
elementType: Si F O O C C C C C C C C C C C C C C C C C C C C C C C C C H H H H H H H H H H H H H H H H H H H H H H H H H H H H H
charge: 0
multiplicity: 1
keywords: wb97x-d3
keywords: def2-TZVPP
keywords: def2/J RIJCOSX
keywords: DEFGRID2
keywords: scfconv7
keywords: smallprint printgap noloewdin
keywords: NOSOSCF
formula: C25H29FO2Si
InChI: InChI=1/C25H29FO2Si/c1-4-27-21-13-15-23(16-14-21)29(2,3)18-8-9-20-12-17-24(26)25(19-20)28-22-10-6-5-7-11-22/h5-7,10-17,19H,4,8-9,18H2,1-3H3
58 atoms
Si -3.549534 1.534718 -0.292523
F  1.925434 -3.440427 -1.551023
O  2.15756 3.204678 0.810052
O  1.687106 -2.08029 0.805892
C  -3.55134 -0.350263 -0.490908
C  -3.499277 -1.118718 0.829248
C  -1.801334 2.099905 0.103367
C  -4.720354 2.022376 1.103422
C  -4.112212 2.328148 -1.906544
C  -3.172898 -2.60518 0.665741
C  -1.166004 1.740426 1.291485
C  -1.045967 2.855509 -0.799828
C  -1.813126 -2.845079 0.067003
C  0.151962 2.076459 1.567218
C  0.261194 3.220623 -0.539787
C  0.880513 2.82463 0.64579
C  -0.672522 -2.33905 0.689103
C  -1.65779 -3.545346 -1.121675
C  0.584861 -2.535446 0.149988
C  -0.401373 -3.752255 -1.67709
C  0.708828 -3.249839 -1.0372
C  2.900321 2.658306 1.882634
C  4.306932 3.202389 1.8056
C  2.464467 -1.136212 0.193735
C  3.812912 -1.130164 0.52387
C  1.947385 -0.195229 -0.686076
C  4.651217 -0.186963 -0.04759
C  2.801781 0.737178 -1.255443
C  4.153272 0.743737 -0.94904
H  -4.434341 -0.662299 -1.059344
H  -2.688916 -0.612477 -1.112933
H  -4.456558 -1.02254 1.348227
H  -2.759123 -0.677209 1.502936
H  -4.775924 3.106274 1.212092
H  -5.732654 1.65633 0.921823
H  -4.398543 1.619174 2.065261
H  -3.491447 2.02456 -2.751076
H  -5.137305 2.036159 -2.140825
H  -4.090827 3.417828 -1.85485
H  -3.232781 -3.094906 1.642565
H  -3.934095 -3.078328 0.039973
H  -1.703921 1.176256 2.04556
H  -1.484633 3.172455 -1.738893
H  0.591849 1.749336 2.499257
H  0.822104 3.812145 -1.252593
H  -0.747819 -1.780032 1.614079
H  -2.529339 -3.940631 -1.627985
H  -0.282366 -4.30382 -2.600224
H  2.908846 1.56415 1.815786
H  2.446923 2.931931 2.843331
H  4.781477 2.924389 0.865894
H  4.318673 4.288441 1.894573
H  4.905308 2.791041 2.618423
H  4.1963 -1.870558 1.213621
H  0.890371 -0.171804 -0.919848
H  5.703658 -0.19019 0.204818
H  2.395037 1.471525 -1.937339
H  4.811062 1.472723 -1.403001
totalener: -1510.04886800 hartree
nucrepener: 2998.31459739 hartree
electener: -4508.36346539 hartree
oneelecener: -8026.09788290 hartree
twoeener: 3517.73441751 hartree
kineticenergy: 1503.95616464 hartree
xcener: -135.239247268085 hartree
chargesum: -0.0000000
charge: 0.439683 -0.195420 -0.282516 -0.304173 -0.227603 -0.125930 -0.118329 -0.387839 -0.438400 -0.129348 -0.158408 -0.029651 -0.002390 -0.208673 -0.293415 0.332027 -0.192195 -0.113110 0.128220 -0.159551 0.267668 0.015149 -0.268605 0.215412 -0.165051 -0.079882 -0.126174 -0.149846 -0.159428 0.077774 0.086242 0.089161 0.053275 0.103639 0.096982 0.091451 0.093869 0.096154 0.098473 0.099049 0.071094 0.118898 0.113164 0.100880 0.115157 0.106109 0.107285 0.121495 0.093984 0.097709 0.088887 0.092738 0.080860 0.120435 0.127351 0.122823 0.123477 0.129362
qa: 0.4397 -0.1954 -0.2825 -0.3042 -0.2276 -0.1259 -0.1183 -0.3878 -0.4384 -0.1293 -0.1584 -0.0297 -0.0024 -0.2087 -0.2934 0.3320 -0.1922 -0.1131 0.1282 -0.1596 0.2677 0.0151 -0.2686 0.2154 -0.1651 -0.0799 -0.1262 -0.1498 -0.1594 0.0778 0.0862 0.0892 0.0533 0.1036 0.0970 0.0915 0.0939 0.0962 0.0985 0.0990 0.0711 0.1189 0.1132 0.1009 0.1152 0.1061 0.1073 0.1215 0.0940 0.0977 0.0889 0.0927 0.0809 0.1204 0.1274 0.1228 0.1235 0.1294
va: 4.1626 1.0996 2.0977 2.0965 3.8071 3.8770 3.8342 3.8858 3.9313 3.8917 3.9650 3.8323 3.7081 3.9139 4.0445 3.7760 3.9533 3.9073 3.8327 3.9550 4.0044 3.8126 3.9724 3.8045 3.9747 3.8090 3.9176 3.9132 3.8879 1.0131 1.0175 1.0090 1.0159 1.0138 1.0085 1.0106 1.0117 1.0167 1.0119 1.0023 1.0118 0.9856 0.9945 1.0220 1.0193 1.0230 1.0109 1.0078 0.9829 0.9928 1.0091 1.0078 1.0069 1.0150 1.0073 1.0001 1.0075 0.9981
dispcorr: -0.035298566 hartree
energy: -1510.084166563759
dipole: -17.91749 17.46958 -0.44791 19.52029 -19.46113 0.05916 6.65667 -6.41291 0.24376
magnitude: 0.51336 au
magnitude: 1.30487 debye
