program: Orca
programVersion: 5.0.2
elementType: O O O C C C C C C C C C C C C C C C C C C C C C C H H H H H H H H H H H H H H H H H H H H H H H H H H
charge: 0
multiplicity: 1
keywords: wb97x-d3
keywords: def2-TZVPP
keywords: def2/J RIJCOSX
keywords: DEFGRID2
keywords: scfconv7
keywords: smallprint printgap noloewdin
keywords: NOSOSCF
formula: C22H26O3
InChI: InChI=1/C22H26O3/c1-15(2)10-19-20(22(19,3)4)21(23)25-14-17-12-18(24-13-17)11-16-8-6-5-7-9-16/h5-10,12-13,19-20H,11,14H2,1-4H3
51 atoms
O  2.024977 0.958095 0.813446
O  2.61781 2.272404 -0.887238
O  -1.659484 3.197941 -0.411721
C  4.204598 -0.950007 -0.235548
C  2.874197 -1.445652 -0.689051
C  3.269336 0.009553 -0.95554
C  4.522175 -0.785387 1.230117
C  5.410022 -1.369735 -1.044466
C  1.799258 -1.849239 0.248075
C  2.617873 1.182992 -0.350694
C  0.541191 -2.129269 -0.104119
C  -0.464691 -2.582659 0.909205
C  0.018736 -1.991772 -1.500579
C  1.288787 2.031962 1.420129
C  -0.005303 2.253007 0.725445
C  -1.067495 1.302436 0.570623
C  -0.419455 3.377759 0.102917
C  -2.045551 1.926386 -0.126341
C  -3.391871 1.51092 -0.606626
C  -3.69409 0.08169 -0.248418
C  -4.078536 -0.255951 1.047171
C  -3.578249 -0.929178 -1.197004
C  -4.340912 -1.57555 1.38654
C  -3.842349 -2.25138 -0.861756
C  -4.223601 -2.578133 0.431572
H  2.901499 -2.025184 -1.607336
H  3.555175 0.219636 -1.979679
H  3.66816 -0.534395 1.852463
H  4.943249 -1.715348 1.616757
H  5.273389 -0.005949 1.36921
H  5.8064 -2.317767 -0.675688
H  5.166215 -1.499258 -2.099364
H  6.20664 -0.626836 -0.97387
H  2.069426 -1.958076 1.293844
H  -0.855429 -3.573071 0.661338
H  -1.328465 -1.912784 0.93448
H  -0.044473 -2.627114 1.913931
H  0.788347 -1.737657 -2.227404
H  -0.74381 -1.208983 -1.541158
H  -0.468411 -2.912921 -1.829844
H  1.885229 2.944607 1.455039
H  1.128087 1.698891 2.444392
H  -1.089709 0.291877 0.945944
H  0.035404 4.345012 -0.044391
H  -3.449598 1.641771 -1.690869
H  -4.15045 2.17241 -0.176696
H  -4.175108 0.521465 1.796186
H  -3.28166 -0.680289 -2.209014
H  -4.639311 -1.821259 2.397551
H  -3.746677 -3.025229 -1.6125
H  -4.427116 -3.607649 0.696034
elementType: O C H
totalener: -1079.73624222 hartree
nucrepener: 2230.53054178 hartree
electener: -3310.26678400 hartree
oneelecener: -5900.39568287 hartree
twoeener: 2590.12889887 hartree
cpcmener: -0.03197629 hartree
kineticenergy: 1074.86448019 hartree
xcener: -106.469729489886 hartree
chargesum: -0.0000000
charge: -0.270272 -0.510355 -0.290485 0.142686 -0.039101 -0.134450 -0.293582 -0.265887 -0.203645 0.440507 -0.040576 -0.225517 -0.288905 0.059911 -0.082184 -0.348373 -0.023738 0.202128 -0.010874 0.044837 -0.205038 -0.243439 -0.129393 -0.133951 -0.189575 0.112534 0.092301 0.090468 0.100767 0.103338 0.093664 0.088195 0.096433 0.127044 0.111592 0.030697 0.100195 0.100984 0.092955 0.106852 0.122754 0.117816 0.190962 0.178999 0.103929 0.111225 0.142783 0.148168 0.157803 0.158151 0.158660
qa: -0.2703 -0.5104 -0.2905 0.1427 -0.0391 -0.1345 -0.2936 -0.2659 -0.2036 0.4405 -0.0406 -0.2255 -0.2889 0.0599 -0.0822 -0.3484 -0.0237 0.2021 -0.0109 0.0448 -0.2050 -0.2434 -0.1294 -0.1340 -0.1896 0.1125 0.0923 0.0905 0.1008 0.1033 0.0937 0.0882 0.0964 0.1270 0.1116 0.0307 0.1002 0.1010 0.0930 0.1069 0.1228 0.1178 0.1910 0.1790 0.1039 0.1112 0.1428 0.1482 0.1578 0.1582 0.1587
va: 2.1100 1.9907 2.2649 3.7552 3.7812 3.8840 3.9033 3.8992 3.7775 4.0935 3.6464 3.9335 3.9445 3.8451 3.6838 3.9565 3.9584 3.6759 3.8388 3.5501 3.9179 3.9034 3.8320 3.8126 3.8739 1.0033 1.0292 1.0125 0.9987 0.9996 1.0021 1.0052 1.0018 1.0021 0.9954 1.0041 1.0149 1.0123 1.0005 0.9980 1.0055 0.9930 0.9724 0.9945 1.0096 1.0031 1.0028 1.0007 0.9898 0.9916 0.9908
dispcorr: -0.029267664 hartree
energy: -1079.765509884830
dipole: 10.13501 -10.48006 -0.34506 -18.51356 17.16479 -1.34878 1.03603 -0.27388 0.76215
magnitude: 1.58718 au
magnitude: 4.03429 debye
