program: Orca
programVersion: 5.0.2
elementType: O O O C C C C C C C C C C C C C C C C C C C C C C H H H H H H H H H H H H H H H H H H H H H H H H H H
charge: 0
multiplicity: 1
keywords: wb97x-d3
keywords: def2-TZVPP
keywords: def2/J RIJCOSX
keywords: DEFGRID2
keywords: scfconv7
keywords: smallprint printgap noloewdin
keywords: NOSOSCF
formula: C22H26O3
InChI: InChI=1/C22H26O3/c1-15(2)10-19-20(22(19,3)4)21(23)25-14-17-12-18(24-13-17)11-16-8-6-5-7-9-16/h5-10,12-13,19-20H,11,14H2,1-4H3
51 atoms
O  2.313016 1.363074 0.218396
O  2.067664 1.554416 -1.992104
O  -1.86497 1.989721 1.446056
C  4.112074 -1.032819 -0.253579
C  2.727493 -1.574392 -0.20845
C  3.057959 -0.408932 -1.151874
C  4.70185 -0.301535 0.926855
C  5.146473 -1.849592 -0.994264
C  1.836674 -1.430865 0.967456
C  2.441488 0.921878 -1.023891
C  0.50711 -1.536762 0.900372
C  -0.35226 -1.437474 2.121115
C  -0.207717 -1.733317 -0.406321
C  1.601603 2.589647 0.460976
C  0.138416 2.34644 0.557853
C  -0.813549 2.149473 -0.496653
C  -0.563221 2.233742 1.709842
C  -2.010314 1.933554 0.09749
C  -3.360011 1.613998 -0.438264
C  -3.627586 0.126679 -0.461624
C  -3.575038 -0.576742 -1.661278
C  -3.902825 -0.570862 0.712617
C  -3.794344 -1.948014 -1.691205
C  -4.11522 -1.9426 0.68689
C  -4.061566 -2.636122 -0.515845
H  2.57252 -2.494107 -0.768213
H  3.136971 -0.689275 -2.195758
H  5.227776 -1.016065 1.563107
H  5.433638 0.436295 0.593703
H  3.975232 0.20959 1.550826
H  5.589495 -2.59529 -0.331144
H  4.716623 -2.377324 -1.846373
H  5.953319 -1.21531 -1.366544
H  2.301425 -1.263484 1.934283
H  -1.08443 -0.632355 2.024308
H  0.231555 -1.257426 3.02368
H  -0.929903 -2.35443 2.267192
H  -1.25658 -1.987259 -0.254993
H  0.24024 -2.528534 -1.005871
H  -0.177695 -0.826064 -1.016737
H  1.844328 3.331136 -0.299911
H  1.98761 2.94901 1.4133
H  -0.631253 2.167588 -1.559033
H  -0.279518 2.314735 2.747712
H  -3.42484 2.01166 -1.45144
H  -4.12394 2.125742 0.152365
H  -3.363301 -0.045847 -2.581978
H  -3.956395 -0.040238 1.655895
H  -3.754091 -2.478358 -2.633985
H  -4.327091 -2.470275 1.60806
H  -4.229627 -3.705075 -0.535988
elementType: O C H
totalener: -1079.73485957 hartree
nucrepener: 2262.09485736 hartree
electener: -3341.82971693 hartree
oneelecener: -5963.83717715 hartree
twoeener: 2622.00746023 hartree
cpcmener: -0.03017861 hartree
kineticenergy: 1074.86013526 hartree
xcener: -106.466706716241 hartree
chargesum: -0.0000000
charge: -0.263508 -0.516854 -0.283501 0.137054 -0.032081 -0.132264 -0.289186 -0.269061 -0.239315 0.434619 -0.016062 -0.257245 -0.261561 0.053406 -0.017481 -0.367785 -0.061644 0.240237 -0.047062 0.066058 -0.205074 -0.238949 -0.151886 -0.152853 -0.155098 0.114624 0.090708 0.098412 0.102514 0.089796 0.094477 0.087970 0.096230 0.128160 0.086820 0.103388 0.110651 0.057955 0.114459 0.095263 0.123564 0.112404 0.159026 0.177925 0.104324 0.117349 0.141297 0.143950 0.157600 0.159571 0.158663
qa: -0.2635 -0.5169 -0.2835 0.1371 -0.0321 -0.1323 -0.2892 -0.2691 -0.2393 0.4346 -0.0161 -0.2572 -0.2616 0.0534 -0.0175 -0.3678 -0.0616 0.2402 -0.0471 0.0661 -0.2051 -0.2389 -0.1519 -0.1529 -0.1551 0.1146 0.0907 0.0984 0.1025 0.0898 0.0945 0.0880 0.0962 0.1282 0.0868 0.1034 0.1107 0.0580 0.1145 0.0953 0.1236 0.1124 0.1590 0.1779 0.1043 0.1173 0.1413 0.1439 0.1576 0.1596 0.1587
va: 2.1109 1.9755 2.2560 3.7563 3.7874 3.8734 3.8957 3.9006 3.7882 4.0812 3.6675 3.9090 3.9567 3.8491 3.5535 3.9629 3.9269 3.5871 3.7972 3.5540 3.9071 3.9010 3.8599 3.8523 3.8500 1.0046 1.0314 0.9987 1.0006 1.0128 1.0020 1.0056 1.0019 0.9996 0.9937 1.0118 0.9955 1.0219 1.0074 1.0019 1.0067 1.0017 1.0217 0.9937 1.0123 1.0086 1.0043 1.0131 0.9910 0.9910 0.9900
dispcorr: -0.030905194 hartree
energy: -1079.765764760513
dipole: 10.79857 -10.78709 0.01148 -13.69242 13.16254 -0.52988 2.83881 -1.87614 0.96267
magnitude: 1.09893 au
magnitude: 2.79325 debye
