program: Orca
programVersion: 5.0.2
elementType: O O O C C C C C C C C C C C C C C C C C C C C C C H H H H H H H H H H H H H H H H H H H H H H H H H H
charge: 0
multiplicity: 1
keywords: wb97x-d3
keywords: def2-TZVPP
keywords: def2/J RIJCOSX
keywords: DEFGRID2
keywords: scfconv7
keywords: smallprint printgap noloewdin
keywords: NOSOSCF
formula: C22H26O3
InChI: InChI=1/C22H26O3/c1-15(2)10-19-20(22(19,3)4)21(23)25-14-17-12-18(24-13-17)11-16-8-6-5-7-9-16/h5-10,12-13,19-20H,11,14H2,1-4H3
51 atoms
O  2.137553 2.041716 0.157268
O  2.253244 0.300837 1.555505
O  -2.122903 1.587229 -1.011978
C  4.904883 -0.455809 0.159102
C  3.86001 -0.928191 -0.790966
C  3.816229 0.511933 -0.251946
C  4.997407 -1.011292 1.559274
C  6.262114 -0.138246 -0.426136
C  2.824933 -1.926278 -0.429205
C  2.684152 0.905345 0.598887
C  1.673059 -2.076099 -1.089584
C  0.694345 -3.148336 -0.726101
C  1.281522 -1.204954 -2.246528
C  0.928248 2.50558 0.781914
C  -0.269127 1.855241 0.184948
C  -0.719794 0.498152 0.313567
C  -1.162583 2.459651 -0.632182
C  -1.841309 0.39069 -0.434841
C  -2.788732 -0.72704 -0.67822
C  -4.098714 -0.503389 0.037363
C  -5.158579 0.139482 -0.594517
C  -4.245487 -0.895956 1.365166
C  -6.342411 0.387677 0.088386
C  -5.427805 -0.652075 2.049075
C  -6.479887 -0.005692 1.412554
H  4.159863 -0.950243 -1.835146
H  4.112349 1.270525 -0.966549
H  5.397496 -0.260706 2.242946
H  4.054967 -1.362341 1.967553
H  5.689016 -1.855867 1.563537
H  6.787861 0.597767 0.184859
H  6.879714 -1.037354 -0.468433
H  6.186769 0.260505 -1.438499
H  3.040679 -2.597834 0.396031
H  0.497267 -3.803563 -1.578737
H  -0.26909 -2.715114 -0.443641
H  1.044307 -3.765923 0.100823
H  0.19791 -1.086427 -2.298466
H  1.591634 -1.654987 -3.193999
H  1.724007 -0.210302 -2.197414
H  0.905941 3.57741 0.591662
H  0.975926 2.359764 1.86121
H  -0.27382 -0.2966 0.888973
H  -1.23944 3.466706 -1.012113
H  -2.318225 -1.644993 -0.32336
H  -2.959821 -0.848903 -1.750976
H  -5.060558 0.445345 -1.629392
H  -3.426242 -1.397782 1.866946
H  -7.159077 0.888047 -0.415886
H  -5.528489 -0.967968 3.079469
H  -7.402282 0.186836 1.944866
elementType: O C H
totalener: -1079.73710485 hartree
nucrepener: 2163.00291068 hartree
electener: -3242.74001552 hartree
oneelecener: -5765.66456301 hartree
twoeener: 2522.92454749 hartree
cpcmener: -0.03102888 hartree
kineticenergy: 1074.86092981 hartree
xcener: -106.463796744298 hartree
chargesum: 0.0000000
charge: -0.293991 -0.499096 -0.289867 0.139683 -0.024281 -0.102072 -0.297777 -0.265758 -0.278439 0.417554 -0.020890 -0.209345 -0.290686 0.074286 -0.074014 -0.343201 -0.038334 0.225625 -0.049792 0.056376 -0.209439 -0.210324 -0.158811 -0.156152 -0.175628 0.114946 0.094636 0.103074 0.089499 0.098405 0.095613 0.094728 0.087680 0.127464 0.103298 0.076991 0.092712 0.092133 0.123405 0.097101 0.118045 0.118667 0.159695 0.178453 0.120008 0.118925 0.143137 0.145087 0.159124 0.160424 0.161125
qa: -0.2940 -0.4991 -0.2899 0.1397 -0.0243 -0.1021 -0.2978 -0.2658 -0.2784 0.4176 -0.0209 -0.2093 -0.2907 0.0743 -0.0740 -0.3432 -0.0383 0.2256 -0.0498 0.0564 -0.2094 -0.2103 -0.1588 -0.1562 -0.1756 0.1149 0.0946 0.1031 0.0895 0.0984 0.0956 0.0947 0.0877 0.1275 0.1033 0.0770 0.0927 0.0921 0.1234 0.0971 0.1180 0.1187 0.1597 0.1785 0.1200 0.1189 0.1431 0.1451 0.1591 0.1604 0.1611
va: 2.1015 1.9821 2.2695 3.7592 3.8043 3.8434 3.8909 3.8980 3.8250 4.0731 3.6789 3.9147 3.9448 3.8572 3.6634 3.9860 3.9736 3.6115 3.7914 3.5787 3.9597 3.9369 3.8940 3.8955 3.8926 1.0027 1.0321 0.9999 1.0180 0.9991 1.0024 1.0022 1.0043 1.0008 0.9958 0.9987 1.0088 1.0003 0.9977 1.0044 0.9976 1.0085 1.0192 0.9931 1.0068 1.0052 1.0073 1.0029 0.9904 0.9901 0.9894
dispcorr: -0.026624637 hartree
energy: -1079.763729485173
dipole: 16.64797 -16.38271 0.26526 -12.59531 12.72386 0.12855 -3.49426 2.52193 -0.97233
magnitude: 1.01603 au
magnitude: 2.58254 debye
