program: Orca
programVersion: 5.0.2
elementType: O O O C C C C C C C C C C C C C C C C C C C C C C H H H H H H H H H H H H H H H H H H H H H H H H H H
charge: 0
multiplicity: 1
keywords: wb97x-d3
keywords: def2-TZVPP
keywords: def2/J RIJCOSX
keywords: DEFGRID2
keywords: scfconv7
keywords: smallprint printgap noloewdin
keywords: NOSOSCF
formula: C22H26O3
InChI: InChI=1/C22H26O3/c1-15(2)10-19-20(22(19,3)4)21(23)25-14-17-12-18(24-13-17)11-16-8-6-5-7-9-16/h5-10,12-13,19-20H,11,14H2,1-4H3
51 atoms
O  2.311128 2.149572 -0.322858
O  1.873435 0.644917 1.270533
O  -2.189522 2.514019 0.472327
C  4.349634 -0.858079 0.031745
C  3.143703 -1.416158 -0.637478
C  3.332589 0.101457 -0.562872
C  4.524455 -0.976686 1.524664
C  5.657118 -0.928589 -0.7206
C  2.086476 -2.148494 0.101189
C  2.440716 0.94477 0.244489
C  0.854168 -2.38059 -0.359149
C  -0.112006 -3.233928 0.402077
C  0.338536 -1.833227 -1.65304
C  1.426905 3.095096 0.278933
C  -0.000131 2.68869 0.137528
C  -0.570285 1.886067 -0.902307
C  -1.029143 3.03548 0.94217
C  -1.896768 1.804836 -0.645576
C  -3.001267 1.07275 -1.308257
C  -3.632237 -0.01073 -0.461493
C  -2.968743 -0.594407 0.61409
C  -4.908487 -0.468934 -0.783829
C  -3.568745 -1.609128 1.350306
C  -5.504864 -1.488879 -0.057171
C  -4.836871 -2.062071 1.017729
H  3.309261 -1.776666 -1.64899
H  3.64019 0.565683 -1.492245
H  5.017906 -1.921465 1.759922
H  5.162876 -0.173948 1.897383
H  3.594805 -0.94614 2.085619
H  6.328087 -0.123225 -0.416305
H  6.16276 -1.875244 -0.520302
H  5.51026 -0.852061 -1.798442
H  2.362281 -2.576617 1.060396
H  -1.026246 -2.683894 0.636028
H  0.31123 -3.601556 1.336538
H  -0.419283 -4.09814 -0.192635
H  0.094095 -2.641784 -2.347112
H  1.041069 -1.16579 -2.149304
H  -0.590853 -1.280194 -1.489259
H  1.621622 4.02023 -0.262794
H  1.68729 3.266872 1.325231
H  -0.056752 1.411786 -1.724441
H  -1.089582 3.628268 1.841515
H  -2.597004 0.629919 -2.22172
H  -3.779286 1.769722 -1.633055
H  -1.973168 -0.265035 0.888399
H  -5.440097 -0.023298 -1.61661
H  -3.039381 -2.044457 2.18828
H  -6.49415 -1.834363 -0.328621
H  -5.301789 -2.853306 1.591239
elementType: O C H
totalener: -1079.73639710 hartree
nucrepener: 2203.80283747 hartree
electener: -3283.53923458 hartree
oneelecener: -5847.54037928 hartree
twoeener: 2564.00114470 hartree
cpcmener: -0.03392018 hartree
kineticenergy: 1074.85960913 hartree
xcener: -106.467629234187 hartree
chargesum: -0.0000000
charge: -0.298086 -0.492287 -0.291025 0.139449 -0.015998 -0.103244 -0.303245 -0.261442 -0.277726 0.409507 -0.022238 -0.202562 -0.265335 0.101261 -0.051909 -0.336079 -0.059100 0.212337 -0.053610 0.078357 -0.237770 -0.209469 -0.156987 -0.150549 -0.178898 0.115345 0.095445 0.102405 0.102536 0.091134 0.095847 0.094354 0.088124 0.128350 0.068116 0.091752 0.097554 0.114397 0.095576 0.071595 0.118109 0.121501 0.164889 0.177228 0.111510 0.115666 0.141876 0.140643 0.162467 0.159826 0.160402
qa: -0.2981 -0.4923 -0.2910 0.1394 -0.0160 -0.1032 -0.3032 -0.2614 -0.2777 0.4095 -0.0222 -0.2026 -0.2653 0.1013 -0.0519 -0.3361 -0.0591 0.2123 -0.0536 0.0784 -0.2378 -0.2095 -0.1570 -0.1505 -0.1789 0.1153 0.0954 0.1024 0.1025 0.0911 0.0958 0.0944 0.0881 0.1284 0.0681 0.0918 0.0976 0.1144 0.0956 0.0716 0.1181 0.1215 0.1649 0.1772 0.1115 0.1157 0.1419 0.1406 0.1625 0.1598 0.1604
va: 2.1153 1.9847 2.2564 3.7494 3.7957 3.8544 3.9005 3.8933 3.8419 4.0562 3.6906 3.9211 3.9545 3.8276 3.6413 3.9820 3.9470 3.5953 3.8538 3.5956 3.8909 3.9643 3.8825 3.8802 3.9060 1.0028 1.0311 0.9980 1.0004 1.0164 1.0024 1.0019 1.0047 0.9974 1.0034 1.0100 0.9988 1.0018 1.0059 0.9982 0.9882 1.0059 1.0074 0.9937 1.0003 1.0048 1.0024 1.0026 0.9892 0.9893 0.9894
dispcorr: -0.027260513 hartree
energy: -1079.763657616287
dipole: 13.23243 -12.67583 0.55660 -16.48397 16.57647 0.09250 -3.16094 1.81022 -1.35072
magnitude: 1.46383 au
magnitude: 3.72076 debye
