program: Orca
programVersion: 5.0.2
elementType: O O O C C C C C C C C C C C C C C C C C C C C C C H H H H H H H H H H H H H H H H H H H H H H H H H H
charge: 0
multiplicity: 1
keywords: wb97x-d3
keywords: def2-TZVPP
keywords: def2/J RIJCOSX
keywords: DEFGRID2
keywords: scfconv7
keywords: smallprint printgap noloewdin
keywords: NOSOSCF
formula: C22H26O3
InChI: InChI=1/C22H26O3/c1-15(2)10-19-20(22(19,3)4)21(23)25-14-17-12-18(24-13-17)11-16-8-6-5-7-9-16/h5-10,12-13,19-20H,11,14H2,1-4H3
51 atoms
O  2.415685 2.177357 -0.202704
O  1.654317 0.760465 1.34546
O  -1.646048 1.691547 -1.332653
C  3.964817 -1.134918 0.547918
C  2.987308 -1.311115 -0.563281
C  3.425437 0.101335 -0.136417
C  3.605396 -1.487491 1.970429
C  5.412234 -1.434775 0.231974
C  1.601057 -1.792082 -0.353083
C  2.418189 1.003741 0.439409
C  0.629172 -1.713613 -1.266937
C  -0.734657 -2.270604 -1.002432
C  0.813533 -1.086018 -2.615324
C  1.392273 3.116268 0.149221
C  0.033783 2.621512 -0.216898
C  -1.119976 2.574016 0.626915
C  -0.348486 2.076798 -1.395056
C  -2.110852 2.003463 -0.09693
C  -3.504546 1.615631 0.235868
C  -3.641671 0.127644 0.461762
C  -3.008953 -0.475071 1.547746
C  -4.384243 -0.665165 -0.405444
C  -3.123514 -1.839109 1.765482
C  -4.497744 -2.034606 -0.191999
C  -3.869007 -2.625149 0.894118
H  3.421151 -1.587763 -1.519482
H  4.104893 0.588043 -0.826239
H  4.156808 -0.858778 2.671451
H  2.549803 -1.396584 2.205659
H  3.894978 -2.521662 2.164816
H  6.078916 -0.881375 0.895875
H  5.61913 -2.498291 0.364442
H  5.669634 -1.171826 -0.794534
H  1.374474 -2.270817 0.594296
H  -1.0225 -2.988425 -1.774571
H  -1.4860 -1.476641 -1.024713
H  -0.794634 -2.769785 -0.03646
H  1.670982 -0.416312 -2.662606
H  -0.073424 -0.518172 -2.901604
H  0.947695 -1.853478 -3.382886
H  1.654725 4.018671 -0.401115
H  1.436948 3.355504 1.213007
H  -1.191264 2.915154 1.647894
H  0.165754 1.901294 -2.326698
H  -4.18764 1.935438 -0.554706
H  -3.79215 2.156274 1.139446
H  -2.422733 0.130501 2.229595
H  -4.881428 -0.210497 -1.254081
H  -2.628671 -2.291313 2.615319
H  -5.079359 -2.63828 -0.87683
H  -3.956736 -3.690682 1.062105
elementType: O C H
totalener: -1079.73625254 hartree
nucrepener: 2247.67705734 hartree
electener: -3327.41330989 hartree
oneelecener: -5935.94799369 hartree
twoeener: 2608.53468380 hartree
cpcmener: -0.03313635 hartree
kineticenergy: 1074.87520279 hartree
xcener: -106.469100429078 hartree
chargesum: 0.0000000
charge: -0.293354 -0.491250 -0.285115 0.148890 -0.031934 -0.096899 -0.298022 -0.264970 -0.261771 0.387889 -0.014289 -0.217759 -0.306863 0.104056 -0.033685 -0.338241 -0.073179 0.207367 -0.051907 0.012602 -0.166862 -0.174238 -0.190670 -0.158109 -0.163460 0.114239 0.094030 0.103621 0.087780 0.098838 0.095504 0.094794 0.087779 0.129817 0.107383 0.061935 0.097022 0.099369 0.092752 0.122121 0.119839 0.119439 0.164432 0.175749 0.107725 0.117469 0.143314 0.140693 0.158483 0.158299 0.159346
qa: -0.2934 -0.4913 -0.2851 0.1489 -0.0319 -0.0969 -0.2980 -0.2650 -0.2618 0.3879 -0.0143 -0.2178 -0.3069 0.1041 -0.0337 -0.3382 -0.0732 0.2074 -0.0519 0.0126 -0.1669 -0.1742 -0.1907 -0.1581 -0.1635 0.1142 0.0940 0.1036 0.0878 0.0988 0.0955 0.0948 0.0878 0.1298 0.1074 0.0619 0.0970 0.0994 0.0928 0.1221 0.1198 0.1194 0.1644 0.1757 0.1077 0.1175 0.1433 0.1407 0.1585 0.1583 0.1593
va: 2.1118 1.9911 2.2456 3.7582 3.7945 3.8365 3.8912 3.8954 3.8277 4.1212 3.6894 3.9239 3.9540 3.8178 3.5986 4.0051 3.9235 3.6102 3.8177 3.6131 3.8661 3.9019 3.8825 3.8736 3.8501 1.0029 1.0313 0.9995 1.0197 0.9994 1.0024 1.0023 1.0042 0.9998 0.9978 1.0018 1.0020 0.9999 0.9967 0.9975 0.9943 1.0053 1.0041 0.9927 1.0119 1.0061 1.0040 1.0034 0.9927 0.9909 0.9905
dispcorr: -0.028823841 hartree
energy: -1079.765076384672
dipole: 10.47494 -10.08085 0.39409 -14.27998 14.55822 0.27824 -1.65356 0.93115 -0.72240
magnitude: 0.86867 au
magnitude: 2.20799 debye
