program: Orca
programVersion: 5.0.2
elementType: O O O C C C C C C C C C C C C C C C C C C C C C C H H H H H H H H H H H H H H H H H H H H H H H H H H
charge: 0
multiplicity: 1
keywords: wb97x-d3
keywords: def2-TZVPP
keywords: def2/J RIJCOSX
keywords: DEFGRID2
keywords: scfconv7
keywords: smallprint printgap noloewdin
keywords: NOSOSCF
formula: C22H26O3
InChI: InChI=1/C22H26O3/c1-15(2)10-19-20(22(19,3)4)21(23)25-14-17-12-18(24-13-17)11-16-8-6-5-7-9-16/h5-10,12-13,19-20H,11,14H2,1-4H3
51 atoms
O  2.041591 1.868282 -0.850601
O  2.574832 1.193111 1.211732
O  -1.658987 0.12289 0.779196
C  5.033495 -0.211657 -0.038443
C  3.897323 -1.120591 -0.357983
C  3.800376 0.38018 -0.684371
C  5.413879 0.091251 1.390027
C  6.235374 -0.277555 -0.952803
C  3.042137 -1.740214 0.68356
C  2.780724 1.171785 0.019155
C  1.799171 -2.17876 0.465119
C  0.997947 -2.837551 1.544289
C  1.120433 -2.063139 -0.867222
C  0.865437 2.526347 -0.350485
C  -0.241532 1.551799 -0.157057
C  -1.065557 0.972159 -1.177092
C  -0.647256 0.989936 1.005406
C  -1.906014 0.113095 -0.556385
C  -2.999146 -0.769197 -1.039172
C  -4.347998 -0.308177 -0.543184
C  -5.067385 0.649414 -1.253208
C  -4.872152 -0.793081 0.65112
C  -6.286511 1.113727 -0.77987
C  -6.090601 -0.328084 1.129009
C  -6.800884 0.627492 0.415383
H  4.018128 -1.717278 -1.258138
H  3.894855 0.621968 -1.736438
H  5.842857 1.09166 1.467366
H  4.592113 0.026979 2.096655
H  6.179076 -0.61651 1.71431
H  6.922764 -1.059402 -0.62456
H  5.95224 -0.495451 -1.983306
H  6.781191 0.667729 -0.948816
H  3.469552 -1.866164 1.673545
H  0.095494 -2.259585 1.761848
H  1.562755 -2.947256 2.46981
H  0.659984 -3.829518 1.233291
H  0.040138 -1.964142 -0.751177
H  1.287258 -2.964244 -1.464248
H  1.47516 -1.215446 -1.45286
H  0.609687 3.252789 -1.119631
H  1.084819 3.07284 0.566879
H  -1.031614 1.176374 -2.235931
H  -0.330768 1.110274 2.029513
H  -2.815175 -1.799378 -0.7216
H  -2.974734 -0.762617 -2.129374
H  -4.669532 1.034348 -2.184981
H  -4.326756 -1.543403 1.21103
H  -6.835853 1.855284 -1.345443
H  -6.485877 -0.714338 2.059649
H  -7.750861 0.98937 0.786428
elementType: O C H
totalener: -1079.73745725 hartree
nucrepener: 2164.27947720 hartree
electener: -3244.01693445 hartree
oneelecener: -5768.40888668 hartree
twoeener: 2524.39195223 hartree
cpcmener: -0.03141386 hartree
kineticenergy: 1074.86713124 hartree
xcener: -106.464769246721 hartree
chargesum: 0.0000000
charge: -0.294483 -0.492831 -0.288961 0.139524 -0.022267 -0.093757 -0.298076 -0.265117 -0.282974 0.387593 -0.001373 -0.217006 -0.303378 0.088284 -0.034946 -0.358595 -0.037690 0.196482 -0.039158 0.065548 -0.207302 -0.210293 -0.158149 -0.158846 -0.175165 0.115159 0.094820 0.103196 0.089949 0.098067 0.094480 0.087461 0.095687 0.126488 0.086087 0.089363 0.101640 0.091735 0.124564 0.098517 0.121902 0.118629 0.156826 0.170550 0.116453 0.112597 0.143970 0.144278 0.160313 0.159569 0.160640
qa: -0.2945 -0.4928 -0.2890 0.1395 -0.0223 -0.0938 -0.2981 -0.2651 -0.2830 0.3876 -0.0014 -0.2170 -0.3034 0.0883 -0.0349 -0.3586 -0.0377 0.1965 -0.0392 0.0655 -0.2073 -0.2103 -0.1581 -0.1588 -0.1752 0.1152 0.0948 0.1032 0.0899 0.0981 0.0945 0.0875 0.0957 0.1265 0.0861 0.0894 0.1016 0.0917 0.1246 0.0985 0.1219 0.1186 0.1568 0.1705 0.1165 0.1126 0.1440 0.1443 0.1603 0.1596 0.1606
va: 2.1005 1.9896 2.2464 3.7566 3.7962 3.8307 3.8888 3.8983 3.8335 4.1220 3.6625 3.9175 3.9560 3.8307 3.5431 3.9912 3.9221 3.5689 3.7921 3.5541 3.9396 3.9530 3.8895 3.8926 3.8929 1.0033 1.0318 0.9997 1.0176 0.9990 1.0025 1.0040 1.0023 1.0004 1.0020 1.0083 0.9947 0.9993 0.9984 1.0034 0.9925 1.0114 1.0111 1.0036 1.0043 1.0086 1.0035 1.0062 0.9900 0.9902 0.9896
dispcorr: -0.026728660 hartree
energy: -1079.764185907563
dipole: 16.18269 -16.27002 -0.08732 -10.90853 10.60128 -0.30725 -0.80618 -0.60775 -1.41393
magnitude: 1.44956 au
magnitude: 3.68448 debye
