program: Orca
programVersion: 5.0.2
elementType: O O O C C C C C C C C C C C C C C C C C C C C C C H H H H H H H H H H H H H H H H H H H H H H H H H H
charge: 0
multiplicity: 1
keywords: wb97x-d3
keywords: def2-TZVPP
keywords: def2/J RIJCOSX
keywords: DEFGRID2
keywords: scfconv7
keywords: smallprint printgap noloewdin
keywords: NOSOSCF
formula: C22H26O3
InChI: InChI=1/C22H26O3/c1-15(2)10-19-20(22(19,3)4)21(23)25-14-17-12-18(24-13-17)11-16-8-6-5-7-9-16/h5-10,12-13,19-20H,11,14H2,1-4H3
51 atoms
O  1.62723 1.839065 1.216261
O  1.870518 0.973376 -0.830209
O  -2.087365 2.452776 -1.05664
C  1.111216 -1.646483 0.732484
C  2.581072 -1.697478 0.492765
C  1.975427 -0.443889 1.103467
C  0.144612 -1.564484 -0.423978
C  0.558247 -2.418065 1.906338
C  3.171595 -1.748936 -0.870081
C  1.83763 0.821851 0.369543
C  4.35711 -1.239056 -1.210668
C  4.903464 -1.38149 -2.598218
C  5.21802 -0.461814 -0.264131
C  1.0887 3.053079 0.666184
C  -0.308013 2.806809 0.221281
C  -1.379634 2.319487 1.037621
C  -0.797349 2.861397 -1.037542
C  -2.431614 2.113209 0.212602
C  -3.768321 1.497639 0.42402
C  -3.698985 0.001404 0.221369
C  -3.492572 -0.84354 1.30831
C  -3.780166 -0.552212 -1.053831
C  -3.372721 -2.214967 1.127457
C  -3.660033 -1.923404 -1.237626
C  -3.454961 -2.75911 -0.147435
H  3.137085 -2.264534 1.235857
H  2.136557 -0.316861 2.167536
H  -0.18887 -2.569417 -0.689748
H  -0.740995 -0.988387 -0.146029
H  0.564071 -1.116283 -1.320943
H  1.265895 -2.460293 2.735039
H  -0.363488 -1.963493 2.275342
H  0.326764 -3.444153 1.613349
H  2.602189 -2.280613 -1.627453
H  4.226771 -1.929756 -3.25336
H  5.864321 -1.9021 -2.590383
H  5.088638 -0.402107 -3.047152
H  5.288151 0.582017 -0.581922
H  6.239241 -0.849572 -0.258823
H  4.850206 -0.473436 0.760005
H  1.71061 3.435795 -0.144166
H  1.130768 3.766127 1.488126
H  -1.358393 2.129485 2.099495
H  -0.366101 3.160756 -1.979947
H  -4.500273 1.941887 -0.253846
H  -4.095712 1.718503 1.440393
H  -3.426493 -0.424931 2.305713
H  -3.941864 0.091492 -1.910432
H  -3.216742 -2.85836 1.98376
H  -3.728834 -2.339491 -2.234473
H  -3.365271 -3.828075 -0.29024
elementType: O C H
totalener: -1079.73511325 hartree
nucrepener: 2234.67387333 hartree
electener: -3314.40898658 hartree
oneelecener: -5909.65783517 hartree
twoeener: 2595.24884859 hartree
cpcmener: -0.03256055 hartree
kineticenergy: 1074.86059351 hartree
xcener: -106.464217143825 hartree
chargesum: 0.0000000
charge: -0.298807 -0.485803 -0.281683 0.190489 -0.024886 -0.090177 -0.294583 -0.284819 -0.286493 0.381079 -0.026728 -0.226511 -0.265290 0.098374 -0.058807 -0.354422 -0.038075 0.209876 -0.049780 0.041467 -0.180218 -0.189683 -0.179025 -0.158831 -0.173496 0.116476 0.096630 0.110059 0.048315 0.104113 0.094108 0.090416 0.097868 0.125186 0.089365 0.096552 0.094388 0.099538 0.105160 0.094616 0.116543 0.121667 0.160310 0.178775 0.112724 0.110360 0.142238 0.141572 0.161694 0.158595 0.159563
qa: -0.2988 -0.4858 -0.2817 0.1905 -0.0249 -0.0902 -0.2946 -0.2848 -0.2865 0.3811 -0.0267 -0.2265 -0.2653 0.0984 -0.0588 -0.3544 -0.0381 0.2099 -0.0498 0.0415 -0.1802 -0.1897 -0.1790 -0.1588 -0.1735 0.1165 0.0966 0.1101 0.0483 0.1041 0.0941 0.0904 0.0979 0.1252 0.0894 0.0966 0.0944 0.0995 0.1052 0.0946 0.1165 0.1217 0.1603 0.1788 0.1127 0.1104 0.1422 0.1416 0.1617 0.1586 0.1596
va: 2.0944 1.9910 2.2604 3.6560 3.8518 3.8203 3.9077 3.9073 3.8507 4.1079 3.7016 3.9256 3.9440 3.8448 3.6316 3.9701 3.9546 3.6104 3.8082 3.5977 3.8747 3.9238 3.8463 3.8765 3.8395 1.0033 1.0305 0.9958 1.0143 1.0211 1.0074 1.0036 1.0006 1.0000 1.0070 0.9967 0.9961 0.9983 1.0003 1.0048 1.0075 0.9916 1.0109 0.9950 1.0135 1.0104 1.0034 1.0089 0.9890 0.9905 0.9909
dispcorr: -0.028461298 hartree
energy: -1079.763574545501
dipole: 14.26495 -14.49725 -0.23229 -14.79184 14.60742 -0.18441 -0.27921 1.52583 1.24663
magnitude: 1.28142 au
magnitude: 3.25712 debye
