program: Orca
programVersion: 5.0.2
elementType: O O O C C C C C C C C C C C C C C C C C C C C C C H H H H H H H H H H H H H H H H H H H H H H H H H H
charge: 0
multiplicity: 1
keywords: wb97x-d3
keywords: def2-TZVPP
keywords: def2/J RIJCOSX
keywords: DEFGRID2
keywords: scfconv7
keywords: smallprint printgap noloewdin
keywords: NOSOSCF
formula: C22H26O3
InChI: InChI=1/C22H26O3/c1-15(2)10-19-20(22(19,3)4)21(23)25-14-17-12-18(24-13-17)11-16-8-6-5-7-9-16/h5-10,12-13,19-20H,11,14H2,1-4H3
51 atoms
O  2.393196 1.712813 0.099762
O  1.919699 1.767998 -2.080177
O  -1.66708 1.990223 1.480919
C  3.611706 -1.013456 -0.179657
C  2.180795 -1.37127 -0.457594
C  2.84817 -0.209964 -1.205418
C  4.016294 -0.477784 1.172555
C  4.65857 -1.931046 -0.770451
C  1.094615 -1.153096 0.520599
C  2.346299 1.175819 -1.110999
C  0.248711 -2.086458 0.972086
C  -0.818204 -1.729796 1.963551
C  0.268886 -3.530971 0.578601
C  1.67555 2.938896 0.349063
C  0.228771 2.647457 0.528317
C  -0.774607 2.493546 -0.482728
C  -0.377132 2.328915 1.696641
C  -1.900352 2.08442 0.14603
C  -3.224757 1.644816 -0.357356
C  -3.324719 0.137574 -0.454592
C  -2.422109 -0.5753 -1.241962
C  -4.32063 -0.560466 0.219317
C  -2.518907 -1.953006 -1.360012
C  -4.419113 -1.942714 0.105114
C  -3.519422 -2.64289 -0.685216
H  2.050348 -2.240502 -1.092916
H  3.085654 -0.448842 -2.235884
H  4.854776 0.215044 1.086841
H  3.218578 0.021635 1.713897
H  4.348833 -1.312644 1.792482
H  4.356928 -2.320104 -1.743602
H  5.607834 -1.407644 -0.900726
H  4.836363 -2.783118 -0.111865
H  0.973457 -0.15275 0.919593
H  -0.82036 -0.667154 2.204862
H  -0.68945 -2.287606 2.895019
H  -1.809165 -1.991057 1.582356
H  -0.708541 -3.840895 0.20063
H  0.470142 -4.1563 1.452294
H  1.01242 -3.775623 -0.17691
H  1.856238 3.661555 -0.446003
H  2.111654 3.328496 1.266547
H  -0.66902 2.659333 -1.54247
H  -0.028711 2.303524 2.71754
H  -3.367555 2.084483 -1.346684
H  -4.026268 2.030199 0.276615
H  -1.635813 -0.048444 -1.770261
H  -5.028114 -0.020467 0.837378
H  -1.809904 -2.490156 -1.976916
H  -5.199886 -2.471194 0.63678
H  -3.593739 -3.718863 -0.774866
elementType: O C H
totalener: -1079.73472674 hartree
nucrepener: 2275.01618007 hartree
electener: -3354.75090681 hartree
oneelecener: -5989.58153960 hartree
twoeener: 2634.83063279 hartree
cpcmener: -0.03039645 hartree
kineticenergy: 1074.85996257 hartree
xcener: -106.467900197235 hartree
chargesum: -0.0000000
charge: -0.270456 -0.502675 -0.279971 0.148264 0.018260 -0.135791 -0.273274 -0.273203 -0.304152 0.420269 -0.033467 -0.243967 -0.256539 0.060225 -0.055489 -0.307943 -0.050207 0.206108 -0.047203 0.027225 -0.216883 -0.190582 -0.151113 -0.135055 -0.180700 0.114697 0.099022 0.103614 0.090628 0.093667 0.089047 0.095113 0.094578 0.114650 0.093631 0.113692 0.075909 0.089829 0.104795 0.091361 0.123850 0.115033 0.161669 0.178145 0.116069 0.104723 0.143224 0.142648 0.161843 0.158168 0.158711
qa: -0.2705 -0.5027 -0.2800 0.1483 0.0183 -0.1358 -0.2733 -0.2732 -0.3042 0.4203 -0.0335 -0.2440 -0.2565 0.0602 -0.0555 -0.3079 -0.0502 0.2061 -0.0472 0.0272 -0.2169 -0.1906 -0.1511 -0.1351 -0.1807 0.1147 0.0990 0.1036 0.0906 0.0937 0.0890 0.0951 0.0946 0.1146 0.0936 0.1137 0.0759 0.0898 0.1048 0.0914 0.1239 0.1150 0.1617 0.1781 0.1161 0.1047 0.1432 0.1426 0.1618 0.1582 0.1587
va: 2.1218 1.9848 2.2552 3.6825 3.7443 3.8999 3.8956 3.9064 3.8056 4.1113 3.7139 3.9149 3.9269 3.8449 3.5969 3.9914 3.9180 3.6346 3.8243 3.6156 3.8654 3.9322 3.8252 3.8563 3.8640 1.0024 1.0258 1.0027 1.0066 1.0017 1.0049 1.0015 1.0019 1.0141 1.0078 1.0027 0.9993 0.9990 0.9973 1.0118 1.0057 1.0017 1.0166 0.9950 1.0045 1.0151 1.0089 1.0026 0.9892 0.9903 0.9919
dispcorr: -0.030664654 hartree
energy: -1079.765391395876
dipole: 8.96649 -8.87896 0.08752 -18.43268 17.72610 -0.70658 5.34484 -4.30395 1.04088
magnitude: 1.26109 au
magnitude: 3.20544 debye
