program: Orca
programVersion: 5.0.2
elementType: O O O C C C C C C C C C C C C C C C C C C C C C C H H H H H H H H H H H H H H H H H H H H H H H H H H
charge: 0
multiplicity: 1
keywords: wb97x-d3
keywords: def2-TZVPP
keywords: def2/J RIJCOSX
keywords: DEFGRID2
keywords: scfconv7
keywords: smallprint printgap noloewdin
keywords: NOSOSCF
formula: C22H26O3
InChI: InChI=1/C22H26O3/c1-15(2)10-19-20(22(19,3)4)21(23)25-14-17-12-18(24-13-17)11-16-8-6-5-7-9-16/h5-10,12-13,19-20H,11,14H2,1-4H3
51 atoms
O  2.012619 0.948451 0.818396
O  2.658415 2.294478 -0.836954
O  -1.657087 3.205859 -0.411862
C  4.224474 -0.933453 -0.242847
C  2.889347 -1.432719 -0.684974
C  3.277703 0.023696 -0.947735
C  4.552654 -0.769647 1.22077
C  5.42407 -1.349993 -1.062316
C  1.830909 -1.852644 0.264316
C  2.632396 1.195942 -0.328269
C  0.578483 -2.171035 -0.074028
C  -0.405624 -2.649233 0.950041
C  0.040156 -2.064943 -1.467007
C  1.273028 2.015459 1.428477
C  -0.015351 2.245952 0.72565
C  -1.084522 1.304965 0.564355
C  -0.420779 3.37452 0.103173
C  -2.053978 1.94089 -0.134595
C  -3.403097 1.540726 -0.621409
C  -3.724545 0.114125 -0.268965
C  -4.101487 -0.225973 1.028363
C  -3.6370 -0.892793 -1.224682
C  -4.387101 -1.542125 1.361154
C  -3.918303 -2.212582 -0.894391
C  -4.295815 -2.540704 0.399373
H  2.911669 -2.011302 -1.604088
H  3.552594 0.241683 -1.973549
H  3.704847 -0.505595 1.846931
H  4.966887 -1.70171 1.610946
H  5.312117 0.003545 1.35385
H  5.820434 -2.303324 -0.705938
H  5.175213 -1.46928 -2.117666
H  6.224668 -0.610688 -0.991122
H  2.113607 -1.949728 1.307928
H  -1.260977 -1.970997 1.023315
H  0.040428 -2.733788 1.941518
H  -0.815378 -3.626817 0.680641
H  0.748304 -1.635657 -2.173943
H  -0.857949 -1.442607 -1.480958
H  -0.260785 -3.045772 -1.845751
H  1.868755 2.928382 1.478868
H  1.102136 1.672996 2.448546
H  -1.116408 0.293294 0.936006
H  0.042826 4.337789 -0.044139
H  -3.455505 1.676444 -1.705653
H  -4.156422 2.210384 -0.193781
H  -4.178176 0.547467 1.784078
H  -3.348419 -0.643724 -2.239218
H  -4.683203 -1.788525 2.373016
H  -3.846025 -2.98279 -1.651864
H  -4.518838 -3.567857 0.658421
elementType: O C H
totalener: -1079.74835463 hartree
nucrepener: 2223.07413411 hartree
electener: -3302.82248874 hartree
oneelecener: -5885.34995592 hartree
twoeener: 2582.52746718 hartree
cpcmener: -0.02640575 hartree
kineticenergy: 1074.86806053 hartree
xcener: -106.467724071478 hartree
chargesum: 0.0000000
charge: -0.266692 -0.475922 -0.281852 0.140101 -0.035617 -0.131903 -0.294263 -0.264028 -0.200996 0.417126 -0.045915 -0.222310 -0.275724 0.056212 -0.078302 -0.339721 -0.021842 0.202967 -0.012774 0.044724 -0.206575 -0.234290 -0.127908 -0.136038 -0.181743 0.110385 0.091485 0.090668 0.100093 0.102289 0.092927 0.086390 0.095731 0.121412 0.040356 0.096885 0.106068 0.097245 0.083659 0.107236 0.119148 0.114960 0.181516 0.173651 0.101649 0.109667 0.140032 0.144235 0.154339 0.155726 0.155533
qa: -0.2667 -0.4759 -0.2819 0.1401 -0.0356 -0.1319 -0.2943 -0.2640 -0.2010 0.4171 -0.0459 -0.2223 -0.2757 0.0562 -0.0783 -0.3397 -0.0218 0.2030 -0.0128 0.0447 -0.2066 -0.2343 -0.1279 -0.1360 -0.1817 0.1104 0.0915 0.0907 0.1001 0.1023 0.0929 0.0864 0.0957 0.1214 0.0404 0.0969 0.1061 0.0972 0.0837 0.1072 0.1191 0.1150 0.1815 0.1737 0.1016 0.1097 0.1400 0.1442 0.1543 0.1557 0.1555
va: 2.1071 2.0335 2.2764 3.7591 3.7772 3.8755 3.9046 3.8992 3.7969 4.1311 3.6685 3.9357 3.9368 3.8553 3.6838 3.9602 3.9633 3.6704 3.8381 3.5578 3.9230 3.9072 3.8436 3.8299 3.8781 1.0026 1.0288 1.0129 0.9988 0.9999 1.0021 1.0054 1.0021 1.0035 1.0031 1.0143 0.9961 1.0118 1.0054 0.9981 1.0068 0.9926 0.9793 0.9969 1.0101 1.0028 1.0037 1.0024 0.9911 0.9915 0.9916
dispcorr: -0.028725015 hartree
energy: -1079.777079639898
dipole: 10.25419 -10.62731 -0.37312 -18.76178 17.51562 -1.24616 1.02890 -0.35989 0.66901
magnitude: 1.46277 au
magnitude: 3.71807 debye
