program: Gaussian 09
title: 000067864
version: EM64L-G09RevD.01
frameworkgroup: C1[X(C6H7F3O2)]
method: RPBEPBE
basis: SDD
operation: Freq
keyword: #pfreq=noraman
keyword: PBEPBE/SDD
title: #p freq=noraman PBEPBE/SDD
converged: NO YES NO NO
title: Mulliken charges:
elementType: F F F O O C C C C C C H H H H H H H
charge: -0.160045 -0.128150 -0.148369 -0.164800 -0.142432 -0.601651 -0.461961 0.240659 0.139355 -0.666605 0.338131 0.266029 0.292760 0.277631 0.234593 0.234006 0.219923 0.230925
chargesum: 0.00000
title: Mulliken charges with hydrogens summed into heavy atoms:
elementType: F F F O O C C C C C C
charge: -0.160045 -0.128150 -0.148369 -0.164800 -0.142432 -0.042862 0.050263 0.240659 0.139355 0.018250 0.338131
polarizability: 8.89397273e+01 -5.95234818e+00 7.52393942e+01 -3.41609060e+00 9.91147197e-01 5.76092093e+01
1716.lowfreq: -8.5482 0.0005 0.0011 0.0012 2.5027 6.8411 18.0370 30.0402 54.2990
frequency: 17.3500 29.9552 54.2919 60.0426 143.1048 183.0823 187.5356 213.5499 237.9862 313.1814 368.2863 392.5994 437.4297 479.4050 499.2518 543.1667 594.5745 667.3393 718.7873 754.2368 815.5755 911.4783 988.1285 992.6564 1002.7972 1043.8120 1068.8585 1082.0256 1102.0137 1144.4550 1208.2146 1245.7860 1283.7684 1341.9038 1399.9791 1433.2152 1444.1254 1471.7027 1480.2128 1629.9614 1662.5819 2965.6826 3002.4382 3016.7106 3021.6071 3100.3950 3104.5098 3120.0337
redmass: 6.5393 7.7280 5.1993 2.5241 3.0016 6.3755 1.4311 7.3903 3.3630 8.6476 6.8534 3.7300 14.3565 2.8844 6.8753 4.7489 4.7202 7.5378 3.1998 2.4591 2.1554 2.2078 3.7027 4.0452 3.2055 2.9275 1.7384 4.9789 2.4788 1.8808 1.7949 1.2850 1.6645 1.7463 1.2040 1.0943 1.0959 1.0397 1.0491 10.1225 8.7754 1.0647 1.0360 1.0913 1.0628 1.1005 1.1003 1.1018
irintensity: 0.4712 0.4699 4.1499 1.0275 3.9235 5.2039 1.1611 1.6019 9.8794 2.1670 3.4127 1.3259 3.5011 1.1726 12.5423 7.1069 30.4234 0.4204 3.4275 4.3609 6.1614 17.3755 73.9637 280.3860 105.9694 104.3878 23.6274 226.8838 92.4023 27.4492 38.6473 6.7039 28.4690 32.9759 19.0350 37.4455 26.3899 13.7679 13.2296 251.9974 24.4913 12.9241 21.2990 0.7036 0.4101 25.2059 20.3014 1.4061
temp: 298.150 k
press: 1.00000 atm
elementType: 9 9 9 8 8 6 6 6 6 6 6 1 1 1 1 1 1 1
symmnumber: 1
zpe: 322870.8 jmol-1
zpe.correction: 0.122975 hartree
zpe.thermalcorrener: 0.135038 hartree
zpe.thermalcorrenthalpy: 0.135982 hartree
zpe.thermalcorrgfe: 0.082017 hartree
zpe.sumelectzpe: -681.939170 hartree
zpe.sumelectthermal: -681.927107 hartree
zpe.sumelectthermalent: -681.926162 hartree
zpe.sumelectthermalfe: -681.980128 hartree
dipole: 2.4484 1.0526 2.3290
dipole: 3.5393
quadrupole: -63.6761 -72.2367 -59.7537
quadrupole: 5.6824 1.1248 -1.0687
quadrupole: 1.5460 -7.0145 5.4685 5.6824 1.1248 -1.0687
hfenergy: -682.0621449 hartree
pointgroup: C01 [X(C6H7F3O2)]
dipole: -0.901109 -1.0012828 -0.3527173 debye
dipolederiv: -0.6630866 0.2285375 -0.1007953 0.1451904 -0.5643248 0.0771958 -0.1621114 0.1223304 -0.313952 -0.5360243 -0.2081347 0.2181487 -0.2360758 -0.4719553 0.232234 0.1503137 0.1804438 -0.4724814 -0.4472089 -0.001432 0.0417355 -0.0111047 -0.4511356 -0.2122144 0.0326463 -0.2283708 -0.5395613 -0.6077853 0.0503298 0.0712938 0.2238199 -0.2904456 -0.2277417 0.2257291 -0.1153914 -0.8747493 -0.3465948 -0.0624706 -0.1341782 -0.1835076 -0.33254 0.1362465 0.3008558 0.1182455 -0.8745793 -0.9801366 -0.0651386 0.5074561 -0.0564079 -0.1260686 0.1257607 0.3727423 0.0548252 -0.259411 -0.202879 0.0198137 -0.1269364 -0.0051066 0.0940932 -0.0962208 -0.1712173 -0.0467887 -0.2508911 1.3828761 -0.1630845 -0.1753279 -0.4995577 0.1772722 0.3962828 -0.1465327 0.232918 0.9794214 0.5432958 0.3515812 0.0504423 0.6461689 0.312262 -0.3815334 -0.4098602 -0.2059896 1.0204871 -0.0151114 0.044657 0.0255768 0.0258935 0.0414142 -0.0040029 -0.0262433 -0.0129596 0.0797973 1.5405944 -0.1165234 -0.2507295 -0.0225624 1.4584434 -0.0729384 -0.132121 -0.0789119 1.2464096 0.1584414 -0.0458447 -0.0558608 -0.0624313 0.0352222 -0.0239375 -0.0337342 -0.0558685 0.0667771 0.0285858 0.0336899 -0.0528012 0.0177494 0.100357 -0.0004012 -0.0567849 0.0182779 0.0227388 0.0452132 -0.0163845 0.0699872 0.0236976 0.097081 0.0553031 0.0593404 0.0200139 0.0427551 0.0434487 0.0156732 -0.0285909 0.0268433 -0.1127717 -0.0343548 -0.0031673 -0.0141837 0.1178307 0.0590068 -0.0104118 0.0478402 -0.0237975 0.0546109 0.0755102 0.1224164 0.0608108 -0.0494678 -0.0672753 0.0166756 -0.100949 0.0112194 0.0962629 -0.0231088 -0.1436004 -0.0076749 -0.0324295 0.06464 -0.071533 -0.0063113 -0.0200307 -0.1177774 -0.0220792 0.0213286 -0.0417264 0.0913054 unknown
polarizability: 88.1065338|-0.0730587|57.2341625|-7.1923242|0.0561909|76.4476345 unknown
InChI: InChI=1S/C6H7F3O2/c1-2-4(10)3-5(11)6(7,8)9/h2-3H2,1H3
charge 0 multiplicity 1
18 atoms
F  2.659305 -0.735201 0.37711
F  2.408373 1.065862 -0.984358
F  1.415398 1.04634 1.057375
O  -1.840781 -0.197846 1.876542
O  0.143487 -0.204999 -1.845168
C  -0.30627 -1.284162 0.317781
C  -2.745416 -0.601593 -0.368306
C  -1.677143 -0.630141 0.714721
C  0.467193 -0.419765 -0.657312
C  -3.993706 0.211278 0.014978
C  1.744866 0.254889 -0.067064
H  -0.530078 -2.239387 -0.192607
H  0.265046 -1.474031 1.238743
H  -2.28484 -0.235678 -1.307769
H  -3.014434 -1.658848 -0.581488
H  -4.447627 -0.173331 0.943775
H  -4.745191 0.162522 -0.791911
H  -3.737882 1.270691 0.187859
