program: Orca
programVersion: 5.0.2
elementType: O O O C C C C C C C C C C C C C C C C C C C C C C H H H H H H H H H H H H H H H H H H H H H H H H H H
charge: 0
multiplicity: 1
keywords: wb97x-d3
keywords: def2-TZVPP
keywords: def2/J RIJCOSX
keywords: DEFGRID2
keywords: scfconv7
keywords: smallprint printgap noloewdin
keywords: NOSOSCF
formula: C22H26O3
InChI: InChI=1/C22H26O3/c1-15(2)10-19-20(22(19,3)4)21(23)25-14-17-12-18(24-13-17)11-16-8-6-5-7-9-16/h5-10,12-13,19-20H,11,14H2,1-4H3
51 atoms
O  2.176008 2.040984 -0.441742
O  2.313108 0.800009 1.409601
O  -1.890674 0.705268 -1.276889
C  4.981802 -0.300657 0.290134
C  3.939324 -1.049811 -0.467286
C  3.875976 0.482717 -0.383699
C  5.081543 -0.409737 1.792085
C  6.334295 -0.161246 -0.371147
C  2.923942 -1.908343 0.191458
C  2.735723 1.096746 0.317306
C  1.729757 -2.202007 -0.330194
C  0.773439 -3.116832 0.370041
C  1.251635 -1.657507 -1.641607
C  0.942467 2.628153 0.004694
C  -0.215868 1.723249 -0.234468
C  -0.775725 0.728637 0.634188
C  -0.939418 1.654022 -1.377045
C  -1.787063 0.143076 -0.048624
C  -2.75348 -0.934111 0.29014
C  -4.177139 -0.435227 0.318968
C  -4.971461 -0.484536 -0.822599
C  -4.707681 0.114671 1.482372
C  -6.270666 0.004578 -0.802089
C  -6.006587 0.602287 1.506928
C  -6.792186 0.549499 0.362921
H  4.238389 -1.3851 -1.457052
H  4.158314 0.997689 -1.29479
H  5.502234 0.504796 2.214658
H  4.135378 -0.597222 2.290542
H  5.757099 -1.227768 2.051383
H  6.958047 -1.031336 -0.155657
H  6.253215 -0.074199 -1.455756
H  6.860438 0.723017 -0.005653
H  3.191677 -2.348877 1.147322
H  1.194088 -3.534072 1.285073
H  0.475287 -3.94831 -0.274407
H  -0.146371 -2.586649 0.633848
H  1.316374 -2.420377 -2.422809
H  1.819512 -0.7925 -1.980477
H  0.200498 -1.367561 -1.584733
H  0.844656 3.535636 -0.589563
H  1.011869 2.923105 1.052526
H  -0.467119 0.488676 1.638865
H  -0.892202 2.201687 -2.306096
H  -2.474333 -1.336521 1.264913
H  -2.662501 -1.755108 -0.427306
H  -4.574732 -0.915534 -1.734386
H  -4.099335 0.159406 2.378395
H  -6.877212 -0.043005 -1.697566
H  -6.406778 1.022138 2.421122
H  -7.806244 0.927765 0.380967
elementType: O C H
totalener: -1079.75031077 hartree
nucrepener: 2167.29258564 hartree
electener: -3247.04289641 hartree
oneelecener: -5774.20692178 hartree
twoeener: 2527.16402537 hartree
cpcmener: -0.02570285 hartree
kineticenergy: 1074.86392197 hartree
xcener: -106.462563866080 hartree
chargesum: -0.0000000
charge: -0.286578 -0.465549 -0.282393 0.140508 -0.021647 -0.107304 -0.299323 -0.264960 -0.268275 0.389429 -0.002661 -0.215057 -0.294444 0.065667 -0.061898 -0.309082 -0.037406 0.187150 -0.044856 0.063555 -0.197357 -0.204739 -0.164107 -0.158258 -0.165990 0.111393 0.094012 0.099840 0.094230 0.096816 0.093965 0.085650 0.095487 0.120450 0.091848 0.098769 0.079868 0.121119 0.093105 0.090651 0.119310 0.117411 0.153026 0.170549 0.113114 0.117410 0.137847 0.141230 0.155594 0.155552 0.157328
qa: -0.2866 -0.4655 -0.2824 0.1405 -0.0216 -0.1073 -0.2993 -0.2650 -0.2683 0.3894 -0.0027 -0.2151 -0.2944 0.0657 -0.0619 -0.3091 -0.0374 0.1871 -0.0449 0.0636 -0.1974 -0.2047 -0.1641 -0.1583 -0.1660 0.1114 0.0940 0.0998 0.0942 0.0968 0.0940 0.0857 0.0955 0.1205 0.0918 0.0988 0.0799 0.1211 0.0931 0.0907 0.1193 0.1174 0.1530 0.1705 0.1131 0.1174 0.1378 0.1412 0.1556 0.1556 0.1573
va: 2.1054 2.0231 2.2610 3.7474 3.8130 3.8243 3.8908 3.8981 3.8511 4.1243 3.6686 3.9246 3.9535 3.8669 3.5984 3.9555 3.9516 3.5777 3.7733 3.5791 3.9574 3.9463 3.9078 3.9033 3.8951 1.0042 1.0315 1.0006 1.0179 0.9986 1.0023 1.0044 1.0024 1.0028 1.0099 0.9953 0.9985 0.9990 1.0082 0.9961 0.9962 1.0063 1.0231 0.9958 1.0070 1.0001 1.0088 1.0040 0.9917 0.9917 0.9905
dispcorr: -0.026928789 hartree
energy: -1079.777239559015
dipole: 16.37651 -16.22199 0.15452 -11.78216 11.72464 -0.05752 0.60216 -1.39065 -0.78849
magnitude: 0.80554 au
magnitude: 2.04753 debye
