program: Orca
programVersion: 5.0.2
elementType: O O O C C C C C C C C C C C C C C C C C C C C C C H H H H H H H H H H H H H H H H H H H H H H H H H H
charge: 0
multiplicity: 1
keywords: wb97x-d3
keywords: def2-TZVPP
keywords: def2/J RIJCOSX
keywords: DEFGRID2
keywords: scfconv7
keywords: smallprint printgap noloewdin
keywords: NOSOSCF
formula: C22H26O3
InChI: InChI=1/C22H26O3/c1-15(2)10-19-20(22(19,3)4)21(23)25-14-17-12-18(24-13-17)11-16-8-6-5-7-9-16/h5-10,12-13,19-20H,11,14H2,1-4H3
51 atoms
O  2.120941 2.059302 -0.293252
O  2.18818 0.658983 1.447073
O  -1.835828 0.773599 -1.553977
C  4.933992 -0.289459 0.334051
C  3.927616 -1.027199 -0.478679
C  3.813634 0.496697 -0.312658
C  5.010074 -0.481651 1.828825
C  6.290305 -0.062147 -0.293853
C  2.935815 -1.956343 0.113169
C  2.651561 1.049452 0.401741
C  1.771564 -2.260487 -0.466406
C  0.81484 -3.231089 0.152369
C  1.337996 -1.623957 -1.757559
C  0.853523 2.586249 0.1293
C  -0.267284 1.698335 -0.285087
C  -0.859249 0.603055 0.424627
C  -0.903882 1.742984 -1.480154
C  -1.805422 0.080436 -0.390692
C  -2.804425 -1.007155 -0.217299
C  -4.160998 -0.459402 0.160127
C  -5.053834 -0.024339 -0.815476
C  -4.520435 -0.339219 1.499638
C  -6.279636 0.521547 -0.458838
C  -5.745893 0.20411 1.858979
C  -6.629232 0.638495 0.87979
H  4.243336 -1.293174 -1.485093
H  4.0959 1.069584 -1.188482
H  4.056889 -0.706134 2.298106
H  5.689068 -1.306763 2.05392
H  5.412673 0.411453 2.310656
H  6.954154 -0.905271 -0.09149
H  6.224933 0.053869 -1.376707
H  6.762962 0.836329 0.108484
H  3.190511 -2.428751 1.056993
H  0.593211 -4.05569 -0.530456
H  -0.142021 -2.747914 0.371538
H  1.197791 -3.655473 1.080706
H  2.096959 -1.720142 -2.537339
H  1.150937 -0.553649 -1.636659
H  0.41987 -2.071207 -2.138973
H  0.7793 3.549669 -0.372548
H  0.847032 2.768647 1.204459
H  -0.618293 0.259355 1.41783
H  -0.797225 2.386734 -2.340125
H  -2.444033 -1.677585 0.564103
H  -2.876105 -1.597715 -1.134356
H  -4.792773 -0.115593 -1.86344
H  -3.834936 -0.674839 2.269385
H  -6.963769 0.855285 -1.228822
H  -6.011172 0.287415 2.905442
H  -7.585311 1.063231 1.158152
elementType: O C H
totalener: -1079.74882383 hartree
nucrepener: 2168.01739981 hartree
electener: -3247.76622363 hartree
oneelecener: -5775.60586234 hartree
twoeener: 2527.83963871 hartree
cpcmener: -0.02565185 hartree
kineticenergy: 1074.85618967 hartree
xcener: -106.460421865757 hartree
chargesum: -0.0000000
charge: -0.287556 -0.464978 -0.278786 0.131499 -0.023213 -0.100606 -0.297861 -0.263517 -0.261172 0.386232 -0.016403 -0.210280 -0.282445 0.066681 -0.068894 -0.325760 -0.035264 0.226186 -0.059465 0.053496 -0.208750 -0.200571 -0.155361 -0.151650 -0.172254 0.110867 0.090506 0.094513 0.097907 0.099503 0.093320 0.085509 0.095754 0.121825 0.099714 0.079697 0.089349 0.113288 0.086078 0.101363 0.118637 0.116432 0.154213 0.171432 0.111466 0.119804 0.138953 0.140415 0.156270 0.156420 0.157461
qa: -0.2876 -0.4650 -0.2788 0.1315 -0.0232 -0.1006 -0.2979 -0.2635 -0.2612 0.3862 -0.0164 -0.2103 -0.2824 0.0667 -0.0689 -0.3258 -0.0353 0.2262 -0.0595 0.0535 -0.2087 -0.2006 -0.1554 -0.1517 -0.1723 0.1109 0.0905 0.0945 0.0979 0.0995 0.0933 0.0855 0.0958 0.1218 0.0997 0.0797 0.0893 0.1133 0.0861 0.1014 0.1186 0.1164 0.1542 0.1714 0.1115 0.1198 0.1390 0.1404 0.1563 0.1564 0.1575
va: 2.1017 2.0240 2.2709 3.7633 3.8112 3.8317 3.8908 3.8973 3.8149 4.1160 3.6714 3.9162 3.9559 3.8683 3.6083 3.9530 3.9526 3.5617 3.7893 3.5989 3.9683 3.9405 3.9036 3.8990 3.9011 1.0064 1.0335 1.0183 0.9986 1.0007 1.0027 1.0049 1.0023 1.0012 0.9953 0.9979 1.0104 1.0018 0.9999 1.0060 0.9958 1.0072 1.0225 0.9960 1.0093 1.0082 1.0108 1.0039 0.9912 0.9913 0.9905
dispcorr: -0.026941925 hartree
energy: -1079.775765751587
dipole: 16.52039 -16.36640 0.15399 -11.61539 11.63302 0.01763 0.49754 -1.30903 -0.81148
magnitude: 0.82615 au
magnitude: 2.09992 debye
